TextualBody
type: Class

SPDX 2.3
type: Ontology
comment: This specification describes the SPDX® language, defined as a dictionary of named properties and classes using W3C's RDF Technology. SPDX® is an open standard for communicating software bill of material information, including components, licenses, copyrights, and security references. SPDX reduces redundant work by providing a common format for companies and communities to share important data, thereby streamlining and improving compliance. . Known issues: - rdfs:comment and rdfs:seeAlso are used within the SPDX classes and causes a redefinition of these standard terms
versionIRI: http://spdx.org/rdf/terms/2.3
versionInfo: 2.3

Cable
type: RunningProject
type: Proposal
type: Project
proposal name: Cable
proposal status: Running
proposal website: cable
to fund: Assure Fund

A rule based on triple (subject, predicate, object) pattern.
type: Class
subclass of: Rule

subject
type: Property
comment: The subject of the subject RDF statement.
domain: Statement

Date Copyrighted
type: Property
comment: Date of copyright.
comment: Date of copyright of the resource.
subPropertyOf: Date
date: 2002-07-13
date: 2008-01-14
description: Typically a year. Recommended practice is to describe the date, date/time, or period of time as recommended for the property Date, of which this is a subproperty.
Relation: dateCopyrighted-002
Has Version: dateCopyrighted-002
issued: 2002-07-13
Date Modified: 2008-01-14

GNU Mes: Full Source bootstrap
type: CompletedProject
type: Proposal
type: Project
proposal name: GNU Mes: Full Source bootstrap
proposal status: Complete
proposal website: mes
to fund: PET Fund

Relationship
type: Class
comment: A Relationship represents a relationship between two SpdxElements.
subclass of: Class
  type: Restriction
  maxQualifiedCardinality: 1
  onDataRange: string
  onProperty: comment
subclass of: Class
  type: Restriction
  onClass: SpdxElement
  onProperty: relatedSpdxElement
  qualifiedCardinality: 1
subclass of: Class
  type: Restriction
  onClass: RelationshipType
  onProperty: relationshipType
  qualifiedCardinality: 1
term status: stable

one or more path
type: Property
comment: The (single) value of this property represents a path that is matched one or more times.

Silicon verification
type: RunningProject
type: Proposal
type: Project
proposal name: Silicon verification
proposal status: Running
proposal website: betrusted.io
to fund: Entrust Fund

Federated software forges with Gitea
type: CompletedProject
type: Proposal
type: Project
proposal name: Federated software forges with Gitea
proposal status: Complete
proposal website: gitea.io
to fund: Discovery Fund

Agorakit
type: Proposal
type: Project
proposal name: Agorakit
proposal status: Selected
proposal website: en
to fund: Entrust Fund

attributionText
type: Property
type: DatatypeProperty
comment: This field provides a place for the SPDX data creator to record acknowledgements that may be required to be communicated in some contexts. This is not meant to include the actual complete license text (see licenseConculded and licenseDeclared), and may or may not include copyright notices (see also copyrightText). The SPDX data creator may use this field to record other acknowledgements, such as particular clauses from license texts, which may be necessary or desirable to reproduce.
domain: SpdxItem
term status: stable

SWH package manager Data Ingestion
type: CompletedProject
type: Proposal
type: Project
proposal name: SWH package manager Data Ingestion
proposal status: Complete
proposal website: www.softwareheritage.org
to fund: Discovery Fund

Collabora Online and LibreOffice
type: Proposal
type: Project
type: CompletedProject
proposal name: Collabora Online and LibreOffice
proposal status: Complete
proposal website: collaboraonline.github.io
proposal website: www.libreoffice.org
to fund: Discovery Fund

postmarketOS OutOfPocket
type: Proposal
type: Project
proposal name: postmarketOS OutOfPocket
proposal status: Selected
proposal website: postmarketos.org
to fund: postmarketOS Fund

relationshipType containedBy
type: RelationshipType
type: Thing
type: NamedIndividual
comment: A Relationship of relationshipType_containedBy expresses that an SPDXElement is contained by the relatedSPDXElement. For example, a File contained by a Package.
term status: stable

Question
type: Class
comment: A question of any sort.
subclass of: IntransitiveActivity

P2Pcollab
type: CompletedProject
type: Proposal
type: Project
proposal name: P2Pcollab
proposal status: Complete
proposal website: p2pcollab.net
to fund: Discovery Fund

Lightmeter
type: CompletedProject
type: Proposal
type: Project
proposal name: Lightmeter
proposal status: Complete
proposal website: lightmeter.io
to fund: PET Fund

relationshipType documentation
type: RelationshipType
type: Thing
type: NamedIndividual
comment: To be used when SPDXRef-A provides documentation of SPDXRef-B.
term status: stable

shape validator
type: Property
comment: The validator(s) used to evaluate a constraint in the context of a node shape.
domain: Constraint component
range: Validator

licenseExceptionTemplate
type: Property
type: DatatypeProperty
comment: Template for matching license exception text
domain: LicenseException
term status: stable

FileSender System improvements
type: RunningProject
type: Proposal
type: Project
proposal name: FileSender System improvements
proposal status: Running
proposal website: filesender.org
to fund: FileSender

hasStartSelector
type: Property
comment: The relationship between a RangeSelector and the Selector that describes the start position of the range.
domain: RangeSelector
range: Selector

Blink Qt Messaging
type: CompletedProject
type: Proposal
type: Project
proposal name: Blink Qt Messaging
proposal status: Complete
proposal website: icanblink.com
to fund: Assure Fund

JavaScript function name
type: Property
comment: The name of the JavaScript function to execute.
domain: JavaScript executable

default value
type: Property
comment: A default value for a property, for example for user interface tools to pre-populate input fields.
domain: Property shape

Format
type: Property
comment: The file format, physical medium, or dimensions of the resource.
date: 1999-07-02
description: Recommended practice is to use a controlled vocabulary where available. For example, for file formats one could use the list of Internet Media Types [[MIME](https://www.iana.org/assignments/media-types/media-types.xhtml)].
issued: 1999-07-02
note: A [second property](/specifications/dublin-core/dcmi-terms/#http://purl.org/dc/terms/format) with the same name as this property has been declared in the [dcterms: namespace](http://purl.org/dc/terms/). See the Introduction to the document [DCMI Metadata Terms](/specifications/dublin-core/dcmi-terms/) for an explanation.

Dat Private Network
type: CompletedProject
type: Proposal
type: Project
proposal name: Dat Private Network
proposal status: Complete
proposal website: dat.foundation
to fund: PET Fund

fwupd
type: CompletedProject
type: Proposal
type: Project
proposal name: fwupd
proposal status: Complete
proposal website: fwupd.org
to fund: Discovery Fund

Simon J D Cox
type: Agent
type: Person
affiliation: Commonwealth Scientific and Industrial Research Organisation
work info homepage: http://people.csiro.au/Simon-Cox

GPG Lacre project
type: CompletedProject
type: Proposal
type: Project
proposal name: GPG Lacre project
proposal status: Complete
proposal website: gpg-mailgate
to fund: PET Fund

Axiom
type: Class
comment: The class of annotated axioms for which the RDF serialization consists of an annotated subject, predicate and object.
subclass of: Resource

Solid Wallet
type: Proposal
type: Project
proposal name: Solid Wallet
proposal status: Selected
proposal website: solid-control
to fund: Assure Fund

name
type: Property
comment: Human-readable labels for the property in the context of the surrounding shape.
domain: Property shape

describes
type: FunctionalProperty
type: Property
type: ObjectProperty
comment: On a Profile object, describes the object described by the profile
domain: Profile
range: Object

Reproducible F-Droid
type: RunningProject
type: Proposal
type: Project
proposal name: Reproducible F-Droid
proposal status: Running
proposal website: f-droid.org
to fund: Entrust Fund

JShelter Manifest V3
type: RunningProject
type: Proposal
type: Project
proposal name: JShelter Manifest V3
proposal status: Running
proposal website: jshelter.org
to fund: Entrust Fund

Faster and configurable datapath/Linux xfrm
type: CompletedProject
type: Proposal
type: Project
proposal name: Faster and configurable datapath/Linux xfrm
proposal status: Complete
proposal website: nftables
to fund: InternetHardeningFund

Whisperfish
type: Proposal
type: Project
proposal name: Whisperfish
proposal status: Selected
proposal website: whisperfish
to fund: Entrust Fund

Extend EFI support in BSDs
type: CompletedProject
type: Proposal
type: Project
proposal name: Extend EFI support in BSDs
proposal status: Complete
proposal website: 3mdeb.com
to fund: Discovery Fund

crossRef
type: Property
type: ObjectProperty
comment: Cross Reference Detail for a license SeeAlso URL
range: SimpleLicensingInfo

Opaque Sphinx
type: CompletedProject
type: Proposal
type: Project
proposal name: Opaque Sphinx
proposal status: Complete
proposal website: libsphinx
to fund: PET Fund

relationshipType specificationFor
type: RelationshipType
type: Thing
type: NamedIndividual
comment: Is to be used when SPDXRef-A describes, illustrates, or defines a design specification for SPDXRef-B.
term status: stable

Arcan-A12
type: RunningProject
type: Proposal
type: Project
proposal name: Arcan-A12
proposal status: Running
proposal website: www.arcan-fe.com
to fund: Entrust Fund

Libre-SOC
type: Proposal
type: Project
proposal name: Libre-SOC
proposal status: Selected
proposal website: nlnet 2018
to fund: SoC Fund

Keyoxide Mobile
type: RunningProject
type: Proposal
type: Project
proposal name: Keyoxide Mobile
proposal status: Running
proposal website: keyoxide.org
to fund: Assure Fund

IRI
type: Node kind
comment: The node kind of all IRIs.

Libre-SOC Formal Standards Development
type: Proposal
type: Project
proposal name: Libre-SOC Formal Standards Development
proposal status: Selected
proposal website: nlnet 2019 standards
to fund: PET Fund

Package
type: Class
comment: A Package represents a collection of software files that are delivered as a single functional component.
subclass of: SpdxItem
subclass of: Class
  type: Restriction
  minQualifiedCardinality: 0
  onClass: File
  onProperty: hasFile
subclass of: Class
  type: Restriction
  maxQualifiedCardinality: 1
  onDataRange: anyURI
  onProperty: homepage
subclass of: Class
  type: Restriction
  maxQualifiedCardinality: 1
  onDataRange: string
  onProperty: description
subclass of: Class
  type: Restriction
  minQualifiedCardinality: 0
  onClass: ExternalRef
  onProperty: externalRef
subclass of: Class
  type: Restriction
  maxQualifiedCardinality: 1
  onDataRange: string
  onProperty: packageFileName
subclass of: Class
  type: Restriction
  maxQualifiedCardinality: 1
  onClass: Purpose
  onProperty: primaryPackagePurpose
subclass of: Class
  type: Restriction
  maxQualifiedCardinality: 1
  onDataRange: string
  onProperty: sourceInfo
subclass of: Class
  type: Restriction
  maxQualifiedCardinality: 1
  onDataRange: date
  onProperty: builtDate
subclass of: Class
  type: Restriction
  maxQualifiedCardinality: 1
  onClass: PackageVerificationCode
  onProperty: packageVerificationCode
subclass of: Class
  type: Restriction
  maxQualifiedCardinality: 1
  onDataRange: boolean
  onProperty: filesAnalyzed
subclass of: Class
  type: Restriction
  maxQualifiedCardinality: 1
  onDataRange: string
  onProperty: versionInfo
subclass of: Class
  type: Restriction
  maxQualifiedCardinality: 1
  onDataRange: string
  onProperty: originator
subclass of: Class
  type: Restriction
  onDataRange: anyURI
  onProperty: downloadLocation
  qualifiedCardinality: 1
subclass of: Class
  type: Restriction
  maxQualifiedCardinality: 1
  onDataRange: string
  onProperty: summary
subclass of: Class
  type: Restriction
  maxQualifiedCardinality: 1
  onDataRange: date
  onProperty: validUntilDate
subclass of: Class
  type: Restriction
  minQualifiedCardinality: 0
  onClass: Checksum
  onProperty: checksum
subclass of: Class
  type: Restriction
  maxQualifiedCardinality: 1
  onDataRange: date
  onProperty: releaseDate
subclass of: Class
  unionOf: Class
    type: Restriction
    hasValue: noassertion
    onProperty: licenseDeclared
  unionOf: Class
    type: Restriction
    hasValue: none
    onProperty: licenseDeclared
  unionOf: Class
    type: Restriction
    maxQualifiedCardinality: 1
    onClass: AnyLicenseInfo
    onProperty: licenseDeclared
subclass of: Class
  type: Restriction
  maxQualifiedCardinality: 1
  onDataRange: string
  onProperty: supplier
term status: stable

Less-than constraint component
type: Parameterizable
type: Constraint component
comment: A constraint component that can be used to verify that each value node is smaller than all the nodes that have the focus node as subject and the value of a given property as predicate.
parameter: LessThanConstraintComponent-lessThan

relationshipType generatedFrom
type: RelationshipType
type: Thing
type: NamedIndividual
comment: A Relationship of relationshipType_generatedFrom expresses that an SPDXElement was generated from the relatedSPDXElement. For example, a binary File might have been generated from a source File.
term status: stable

Solid-Nextcloud extension
type: Proposal
type: Project
proposal name: Solid-Nextcloud extension
proposal status: Selected
proposal website: solid
to fund: Discovery Fund

ActivityPods
type: RunningProject
type: Proposal
type: Project
proposal name: ActivityPods
proposal status: Running
proposal website: activitypods.org
to fund: Entrust Fund

Converged Security Suite Improvements
type: CompletedProject
type: Proposal
type: Project
proposal name: Converged Security Suite Improvements
proposal status: Complete
proposal website: converged-security-suite
to fund: Assure Fund

onDatatype
type: Property
comment: The property that determines the datatype that a datatype restriction refers to.
domain: Datatype
range: Datatype

The PeARS app
type: CompletedProject
type: Proposal
type: Project
proposal name: The PeARS app
proposal status: Complete
proposal website: pearsproject.org
to fund: Discovery Fund

Announce
type: Class
comment: Actor announces the object to the target
subclass of: Activity

relationshipType fileAdded
type: RelationshipType
type: Thing
type: NamedIndividual
comment: A Relationship of relationshipType_fileAdded expresses that the SPDXElement is a file which has been added to the relatedSPDXElement package. For example, a package (the relatedSPDXElement) has been patched to remove a file (the SPDXElement). This relationship is typically used to express the result of a patched package when the actual patchfile is not present.
term status: stable

TGN
type: VocabularyEncodingScheme
comment: The set of places specified by the Getty Thesaurus of Geographic Names.
date: 2000-07-11
date: 2008-01-14
Relation: TGN-003
Has Version: TGN-003
issued: 2000-07-11
Date Modified: 2008-01-14

Liminix
type: RunningProject
type: Proposal
type: Project
proposal name: Liminix
proposal status: Running
proposal website: for-the-moment
to fund: Entrust Fund

Manyfold
type: RunningProject
type: Proposal
type: Project
proposal name: Manyfold
proposal status: Running
proposal website: van dam
to fund: Entrust Fund

ReferenceCategory
type: Class
comment: Category used for ExternalRef
term status: stable

Wireguard Rust Implementation
type: CompletedProject
type: Proposal
type: Project
proposal name: Wireguard Rust Implementation
proposal status: Complete
proposal website: www.wireguard.com
to fund: PET Fund

motivatedBy
type: Property
comment: The relationship between an Annotation and a Motivation that describes the reason for the Annotation's creation.
domain: Annotation
range: Motivation

Actor
type: Class
comment: Any Object with an inbox is an Actor (extension to the original ontology).
subclass of: Object
subclass of: Class
  type: Restriction
  maxCardinality: 1
  onProperty: inbox
  someValuesFrom: OrderedActivityCollection

W3C Shapes Constraint Language (SHACL) Vocabulary
type: Ontology
comment: This vocabulary defines terms used in SHACL, the W3C Shapes Constraint Language.
declare: PrefixDeclaration
  type: Prefix declaration
  namespace: W3C Shapes Constraint Language (SHACL) Vocabulary
  prefix: sh
suggested shapes graph: shacl-shacl#

Friendly Forge Format (F3)
type: Proposal
type: Project
proposal name: Friendly Forge Format (F3)
proposal status: Selected
proposal website: https://forum.forgefriends.org/t/about-the-friendly-forge-format-f3/681
to fund: Assure Fund

node
type: Property
comment: Specifies the node shape that all value nodes must conform to.
range: Node shape

MaxExclusiveConstraintComponent-maxExclusive
type: Shape
type: Property shape
type: Parameter
max count: 1
node kind: Literal
path: max exclusive

Parameter
type: Class
comment: The class of parameter declarations, consisting of a path predicate and (possibly) information about allowed value type, cardinality and other characteristics.
subclass of: Property shape

Feather UI
type: RunningProject
type: Proposal
type: Project
proposal name: Feather UI
proposal status: Running
proposal website: feathergui
to fund: Core Fund

postmarketOS Fund
fund label: postmarketOS Fund
fund status: Open
proposals accepted: 2
proposals submitted: 2

LiberaForms
type: RunningProject
type: Proposal
type: Project
proposal name: LiberaForms
proposal status: Running
proposal website: liberaforms.org
to fund: Assure Fund

ARPA2 resource ACL and HTTP SASL modules for NGINX
type: CompletedProject
type: Proposal
type: Project
proposal name: ARPA2 resource ACL and HTTP SASL modules for NGINX
proposal status: Complete
proposal website: arpa2.net
to fund: PET Fund

MNT Reform Next
type: RunningProject
type: Proposal
type: Project
proposal name: MNT Reform Next
proposal status: Running
proposal website: reform
to fund: Entrust Fund

purpose archive
type: Purpose
type: Thing
type: NamedIndividual
comment: The package refers to an archived collection of files (.tar, .zip, etc).
term status: stable

JavaScript validator
type: Class
comment: A SHACL validator based on JavaScript. This can be used to declare SHACL constraint components that perform JavaScript-based validation when used.
subclass of: JavaScript executable
subclass of: Validator

downloadLocation
type: DatatypeProperty
type: Property
comment: The URI at which this package is available for download. Private (i.e., not publicly reachable) URIs are acceptable as values of this property. The values http://spdx.org/rdf/terms#none and http://spdx.org/rdf/terms#noassertion may be used to specify that the package is not downloadable or that no attempt was made to determine its download location, respectively.
domain: Package
term status: stable

Accept
type: Class
comment: Actor accepts the Object
subclass of: Activity

searx
type: CompletedProject
type: Proposal
type: Project
proposal name: searx
proposal status: Complete
proposal website: searx
to fund: Discovery Fund

ForgeFlux
type: Proposal
type: Project
proposal name: ForgeFlux
proposal status: Selected
proposal website: forgeflux.org
to fund: Entrust Fund

summary
type: DatatypeProperty
type: Property
comment: Provides a short description of the package.
domain: Package
term status: stable

Spritely
type: CompletedProject
type: Proposal
type: Project
proposal name: Spritely
proposal status: Complete
proposal website: spritelyproject.org
to fund: Discovery Fund

Catalogued resource
type: Class
comment: Resource published or curated by a single agent.
comment: Zdroj publikovaný či řízený jediným činitelem. @cs
comment: Risorsa pubblicata o curata da un singolo agente. @it
comment: Recurso publicado o curado por un agente único. @es
comment: Ressource udgivet eller udvalgt og arrangeret af en enkelt aktør. @da
label: Katalogiseret ressource @da
label: Risorsa catalogata @it
label: Recurso catalogado @es
label: Katalogizovaný zdroj @cs
change note: Nueva clase agregada en DCAT 2.0. @es
change note: Nová třída přidaná ve verzi DCAT 2.0. @cs
change note: Ny klasse i DCAT 2.0. @da
change note: Nuova classe aggiunta in DCAT 2.0. @it
change note: New class added in DCAT 2.0.
scope note: dcat:Resource is an extension point that enables the definition of any kind of catalog. Additional subclasses may be defined in a DCAT profile or application for catalogs of other kinds of resources.
scope note: dcat:Resource er et udvidelsespunkt der tillader oprettelsen af enhver type af kataloger. Yderligere subklasser kan defineres i en DCAT-profil eller i en applikation til kataloger med andre typer af ressourcer. @da
scope note: La clase de todos los recursos catalogados, la superclase de dcat:Dataset, dcat:DataService, dcat:Catalog y cualquier otro miembro de un dcat:Catalog. Esta clase tiene propiedades comunes a todos los recursos catalogados, incluyendo conjuntos de datos y servicios de datos. Se recomienda fuertemente que se use una clase más específica. Cuando se describe un recurso que no es un dcat:Dataset o dcat:DataService, se recomienda crear una sub-clase apropiada de dcat:Resource, o usar dcat:Resource con la propiedad dct:type to indicar el tipo específico. @es
scope note: The class of all catalogued resources, the Superclass of dcat:Dataset, dcat:DataService, dcat:Catalog and any other member of a dcat:Catalog. This class carries properties common to all catalogued resources, including datasets and data services. It is strongly recommended to use a more specific sub-class. When describing a resource which is not a dcat:Dataset or dcat:DataService, it is recommended to create a suitable sub-class of dcat:Resource, or use dcat:Resource with the dct:type property to indicate the specific type.
scope note: La classe di tutte le risorse catalogate, la Superclasse di dcat:Dataset, dcat:DataService, dcat:Catalog e qualsiasi altro membro di dcat:Catalog. Questa classe porta proprietà comuni a tutte le risorse catalogate, inclusi set di dati e servizi dati. Si raccomanda vivamente di utilizzare una sottoclasse più specifica. Quando si descrive una risorsa che non è un dcat:Dataset o dcat:DataService, si raccomanda di creare una sottoclasse di dcat:Resource appropriata, o utilizzare dcat:Resource con la proprietà dct:type per indicare il tipo specifico. @it
scope note: dcat:Resource è un punto di estensione che consente la definizione di qualsiasi tipo di catalogo. Sottoclassi aggiuntive possono essere definite in un profilo DCAT o in un'applicazione per cataloghi di altri tipi di risorse. @it
scope note: Třída všech katalogizovaných zdrojů, nadtřída dcat:Dataset, dcat:DataService, dcat:Catalog a všech ostatních členů dcat:Catalog. Tato třída nese vlastnosti společné všem katalogizovaným zdrojům včetně datových sad a datových služeb. Je silně doporučeno používat specifičtější podtřídy, pokud je to možné. Při popisu zdroje, který není ani dcat:Dataset, ani dcat:DataService se doporučuje vytvořit odpovídající podtřídu dcat:Resrouce a nebo použít dcat:Resource s vlastností dct:type pro určení konkrétního typu. @cs
scope note: Klassen for alle katalogiserede ressourcer, den overordnede klasse for dcat:Dataset, dcat:DataService, dcat:Catalog og enhvert medlem af et dcat:Catalog. Denne klasse bærer egenskaber der gælder alle katalogiserede ressourcer, herunder dataset og datatjenester. Det anbefales kraftigt at mere specifikke subklasser oprettes. Når der beskrives ressourcer der ikke er dcat:Dataset eller dcat:DataService, anbefales det at oprette passende subklasser af dcat:Resource eller at dcat:Resource anvendes sammen med egenskaben dct:type til opmærkning med en specifik typeangivelse. @da
scope note: dcat:Resource je bod pro rozšíření umožňující definici různých druhů katalogů. Další podtřídy lze definovat v profilech DCAT či aplikacích pro katalogy zdrojů jiných druhů. @cs
scope note: dcat:Resource es un punto de extensión que permite la definición de cualquier tipo de catálogo. Se pueden definir subclases adicionales en perfil de DCAT o una aplicación para catálogos de otro tipo de recursos. @es

Qubes OS
type: CompletedProject
type: Proposal
type: Project
proposal name: Qubes OS
proposal status: Complete
proposal website: qubes-os.org
to fund: PET Fund

AVantGaRDe
type: Proposal
type: Project
proposal name: AVantGaRDe
proposal status: Selected
proposal website: ~stefania.dumbrava
to fund: Entrust Fund

versionInfo
type: Property
type: AnnotationProperty
comment: The annotation property that provides version information for an ontology or another OWL construct.
domain: Resource

referencesFile
type: Property
type: ObjectProperty
comment: This property has been replaced by a relationship between the SPDX document and file with a "contains" relationship type.
comment: Indicates that a particular file belongs as part of the set of analyzed files in the SpdxDocument.
domain: SpdxDocument
range: File
deprecated: true
term status: deprecated

Personal Food Facts
type: CompletedProject
type: Proposal
type: Project
proposal name: Personal Food Facts
proposal status: Complete
proposal website: discover
to fund: Discovery Fund

Edalize ASIC backend
type: CompletedProject
type: Proposal
type: Project
proposal name: Edalize ASIC backend
proposal status: Complete
proposal website: edalize
to fund: PET Fund

FragmentSelector
type: Class
comment: The FragmentSelector class is used to record the segment of a representation using the IRI fragment specification defined by the representation's media type.
subclass of: Selector

alsoKnownAs
type: Property
type: ObjectProperty
comment: Another actor which is the same actor. (Mostly used to support account moves.)
domain: Object
range: Actor

Frequency
type: Class
comment: A rate at which something recurs.
date: 2008-01-14
Relation: Frequency-001
Has Version: Frequency-001
issued: 2008-01-14

end
type: Property
comment: The end property is used to convey the 0-based index of the end position of a range of content.

RETETRA
type: CompletedProject
type: Proposal
type: Project
proposal name: RETETRA
proposal status: Complete
proposal website: tetraburst.com
to fund: PET Fund

imports
type: Property
type: OntologyProperty
comment: The property that is used for importing other ontologies into a given ontology.
domain: Ontology
range: Ontology

fileType archive
type: Thing
type: NamedIndividual
type: FileType
comment: Indicates the file is an archive file.
term status: stable

FileSender 3 Continuous Integration test update
type: CompletedProject
type: Proposal
type: Project
proposal name: FileSender 3 Continuous Integration test update
proposal status: Complete
proposal website: filesender.org
to fund: FileSender

XPathSelector
type: Class
comment: An XPathSelector is used to select elements and content within a resource that supports the Document Object Model via a specified XPath value.
subclass of: Selector

SpinalHDL, VexRiscv, SaxonSoc
type: CompletedProject
type: Proposal
type: Project
proposal name: SpinalHDL, VexRiscv, SaxonSoc
proposal status: Complete
proposal website: SpinalHDL
to fund: PET Fund

packageVerificationCodeExcludedFile
type: Property
type: DatatypeProperty
comment: A file that was excluded when calculating the package verification code. This is usually a file containing SPDX data regarding the package. If a package contains more than one SPDX file all SPDX files must be excluded from the package verification code. If this is not done it would be impossible to correctly calculate the verification codes in both files.
domain: PackageVerificationCode
term status: stable

NegativePropertyAssertion
type: Class
comment: The class of negative property assertions.
subclass of: Resource

Requires
type: Property
comment: A related resource that is required by the described resource to support its function, delivery, or coherence.
subPropertyOf: Relation
date: 2008-01-14
date: 2000-07-11
description: This property is intended to be used with non-literal values. This property is an inverse property of Is Required By.
Relation: requires-003
Has Version: requires-003
issued: 2000-07-11
Date Modified: 2008-01-14
note: This term is intended to be used with non-literal values as defined in the DCMI Abstract Model (http://dublincore.org/documents/abstract-model/). As of December 2007, the DCMI Usage Board is seeking a way to express this intention with a formal range declaration.

SinglePointer
type: Class
subclass of: Pointer
subclass of: Class
  type: Restriction
  onClass: File
  onProperty: reference
  qualifiedCardinality: 1
term status: stable

Max-inclusive constraint component
type: Parameterizable
type: Constraint component
comment: A constraint component that can be used to restrict the range of value nodes with a maximum inclusive value.
parameter: MaxInclusiveConstraintComponent-maxInclusive

and
type: Property
comment: RDF list of shapes to validate the value nodes against.
range: List

checksum
type: ObjectProperty
type: Property
comment: The checksum property provides a mechanism that can be used to verify that the contents of a File or Package have not changed.
domain: Class
  unionOf: File
  unionOf: Package
range: Checksum
term status: stable

start date
type: DatatypeProperty
type: Property
domain: Period of Time
label: startdato @da
label: datum začátku @cs
label: data di inizio @it
alternative label: starttidspunkt @da
change note: Nueva propiedad agregada en DCAT 2.0. @es
change note: Nuova proprietà aggiunta in DCAT 2.0. @it
change note: Ny egenskab tilføjet i DCAT 2.0. @da
change note: New property added in DCAT 2.0.
change note: Nová vlastnost přidaná ve verzi DCAT 2.0. @cs
definition: L'inizio del periodo @it
definition: Start på perioden. @da
definition: The start of the period
definition: Začátek doby trvání @cs
definition: El comienzo del período @es
scope note: El rango de esta propiedad es intencionalmente genérico con el propósito de permitir distintos niveles de precisión temporal para especificar el comienzo de un período. Por ejemplo, puede expresarse como una fecha (xsd:date), una fecha y un tiempo (xsd:dateTime), o un año (xsd:gYear). @es
scope note: Il range di questa proprietà è volutamente generico, con lo scopo di consentire diversi livelli di precisione temporale per specificare l'inizio di un periodo. Ad esempio, può essere espresso con una data (xsd:date), una data e un'ora (xsd:dateTime), o un anno (xsd:gYear). @it
scope note: Obor hodnot této vlastnosti je úmyslně obecný, aby umožnil různé úrovně časového rozlišení pro specifikaci začátku doby trvání. Ten může být kupříkladu vyjádřen datumem (xsd:date), datumem a časem (xsd:dateTime) či rokem (xsd:gYear). @cs
scope note: The range of this property is intentionally generic, with the purpose of allowing different level of temporal precision for specifying the start of a period. E.g., it can be expressed with a date (xsd:date), a date and time (xsd:dateTime), or a year (xsd:gYear).
scope note: Rækkeviden for denne egenskab er bevidst generisk defineret med det formål at tillade forskellige niveauer af tidslig præcision ifm. angivelse af startdatoen for en periode. Den kan eksempelvis udtrykkes som en dato (xsd:date), en dato og et tidspunkt (xsd:dateTime), eller et årstal (xsd:gYear). @da

Delete
type: Class
comment: To Delete Something
subclass of: Activity

LineCharPointer
type: Class
subclass of: OffsetPointer
subclass of: Class
  type: Restriction
  onDataRange: positiveInteger
  onProperty: lineNumber
  qualifiedCardinality: 1
term status: stable

SPARQL function
type: Class
comment: A function backed by a SPARQL query - either ASK or SELECT.
subclass of: SPARQL SELECT executable
subclass of: SPARQL ASK executable
subclass of: Function

Martin Alvarez-Espinar
type: Agent

target class
type: Property
comment: Links a shape to a class, indicating that all instances of the class must conform to the shape.
domain: Shape
range: Class

annotatedProperty
type: Property
comment: The property that determines the predicate of an annotated axiom or annotated annotation.
domain: Resource

LicenseException
type: Class
comment: An exception to a license.
subclass of: Class
  type: Restriction
  onDataRange: string
  onProperty: name
  qualifiedCardinality: 1
subclass of: Class
  type: Restriction
  maxQualifiedCardinality: 1
  onDataRange: string
  onProperty: example
subclass of: Class
  type: Restriction
  onDataRange: string
  onProperty: licenseExceptionText
  qualifiedCardinality: 1
subclass of: Class
  type: Restriction
  maxQualifiedCardinality: 1
  onDataRange: string
  onProperty: licenseExceptionTemplate
subclass of: Class
  type: Restriction
  onDataRange: string
  onProperty: comment
  qualifiedCardinality: 1
subclass of: Class
  type: Restriction
  minQualifiedCardinality: 0
  onDataRange: anyURI
  onProperty: seeAlso
subclass of: Class
  type: Restriction
  onDataRange: string
  onProperty: licenseExceptionId
  qualifiedCardinality: 1
term status: stable

SiCl4
type: RunningProject
type: Proposal
type: Project
proposal name: SiCl4
proposal status: Running
proposal website: SiCl4
to fund: Entrust Fund

CeroWRT II
type: CompletedProject
type: Proposal
type: Project
proposal name: CeroWRT II
proposal status: Complete
proposal website: www.bufferbloat.net
to fund: UOI Fund

Funkwhale
type: RunningProject
type: Proposal
type: Project
proposal name: Funkwhale
proposal status: Running
proposal website: funkwhale.audio
to fund: Entrust Fund

Public
type: Class
comment: Activities addressed to this special URI shall be accessible to all users, without authentication. Implementations MUST NOT deliver to the "public" special collection; it is not capable of receiving actual activities.

Core Fund
fund label: NGI Zero Core
fund status: Open
proposals accepted: 55
proposals submitted: 484

Extending PeerTube
type: CompletedProject
type: Proposal
type: Project
proposal name: Extending PeerTube
proposal status: Complete
proposal website: publicspaces.net
to fund: Discovery Fund

licenseInfoInFile
type: Property
type: ObjectProperty
comment: Licensing information that was discovered directly in the subject file. This is also considered a declared license for the file. If the licenseInfoInFile field is not present for a file, it implies an equivalent meaning to NOASSERTION.
domain: File
range: Class
  unionOf: AnyLicenseInfo
  unionOf: Class
    type: Restriction
    hasValue: noassertion
    onProperty: licenseInfoInFile
  unionOf: Class
    type: Restriction
    hasValue: none
    onProperty: licenseInfoInFile
subPropertyOf: licenseInfoFromFiles
term status: stable

ltrDirection
type: Direction
comment: The direction of text that is read from left to right.

CryptPad Blueprints
type: RunningProject
type: Proposal
type: Project
proposal name: CryptPad Blueprints
proposal status: Running
proposal website: cryptpad.org
to fund: Entrust Fund

radius
type: FunctionalProperty
type: Property
type: DatatypeProperty
comment: Specifies a radius around the point established by the longitude and latitude
domain: Place
range: Class
  type: Datatype
  onDatatype: float
  withRestrictions:
    min inclusive: 0.0

has value
type: Property
comment: Specifies a value that must be among the value nodes.

DCMI Point
type: Class
type: Datatype
comment: The set of points in space defined by their geographic coordinates according to the DCMI Point Encoding Scheme.
date: 2000-07-11
date: 2008-01-14
Relation: Point-003
Has Version: Point-003
issued: 2000-07-11
Date Modified: 2008-01-14

flags
type: Property
comment: An optional flag to be used with regular expression pattern matching.

Profile
type: Class
comment: A Profile Document
subclass of: Object

Literal
type: Class
comment: The class of literal values, eg. textual strings and integers.
subclass of: Resource

Native IFC for FreeCAD
type: Proposal
type: Project
proposal name: Native IFC for FreeCAD
proposal status: Selected
proposal website: FreeCAD-NativeIFC
to fund: Entrust Fund

SCION-Pathdiscovery
type: CompletedProject
type: Proposal
type: Project
proposal name: SCION-Pathdiscovery
proposal status: Complete
proposal website: www.netsys.ovgu.de
to fund: Discovery Fund

Hubzilla
type: CompletedProject
type: Proposal
type: Project
proposal name: Hubzilla
proposal status: Complete
proposal website: hubzilla-project
to fund: Discovery Fund

LumoSQL at-rest data security
type: RunningProject
type: Proposal
type: Project
proposal name: LumoSQL at-rest data security
proposal status: Running
proposal website: lumosql.org
to fund: Assure Fund

language
type: Property
comment: The language component of a CompoundLiteral.
domain: CompoundLiteral

member
type: Property
comment: A member of the subject resource.
domain: Resource

relationshipType devToolOf
type: RelationshipType
type: Thing
type: NamedIndividual
comment: Is to be used when SPDXRef-A is a development dependency of SPDXRef-B.
term status: stable

Email <=> XMPP gateway
type: Proposal
type: Project
proposal name: Email <=> XMPP gateway
proposal status: Selected
proposal website: libervia.org
to fund: Core Fund

GNU Mes
type: CompletedProject
type: Proposal
type: Project
proposal name: GNU Mes
proposal status: Complete
proposal website: mes
to fund: PET Fund

Mynij
type: CompletedProject
type: Proposal
type: Project
proposal name: Mynij
proposal status: Complete
proposal website: www.mynij.com
to fund: Discovery Fund

ARPA2 Steamworks
type: CompletedProject
type: Proposal
type: Project
proposal name: ARPA2 Steamworks
proposal status: Complete
proposal website: steamworks.arpa2.net
to fund: InternetHardeningFund

Mention
type: Class
comment: A specialized Link that represents an @mention
subclass of: Link

Restriction
type: Class
comment: The class of property restrictions.
subclass of: Class

Key Management
type: CompletedProject
type: Proposal
type: Project
proposal name: Key Management
proposal status: Complete
proposal website: arpa2
to fund: InternetHardeningFund

SymmetricProperty
type: Class
comment: The class of symmetric properties.
subclass of: ObjectProperty

Solid Application Interoperability
type: RunningProject
type: Proposal
type: Project
proposal name: Solid Application Interoperability
proposal status: Running
proposal website: specification
to fund: Entrust Fund

node kind
type: Property
comment: Specifies the node kind (e.g. IRI or literal) each value node.
range: Node kind

Telecommunication in HF using the Internet Protocol (IPoHF)
type: RunningProject
type: Proposal
type: Project
proposal name: Telecommunication in HF using the Internet Protocol (IPoHF)
proposal status: Running
proposal website: www.rhizomatica.org
to fund: UOI Fund

django-allauth
type: Proposal
type: Project
proposal name: django-allauth
proposal status: Selected
proposal website: allauth.org
to fund: Entrust Fund

XR Fragments
type: RunningProject
type: Proposal
type: Project
proposal name: XR Fragments
proposal status: Running
proposal website: rk8raAkDc
to fund: Entrust Fund

View
type: Class
comment: The actor viewed the object
subclass of: Activity

PreferContainedDescriptions
comment: An IRI to signal the client prefers to receive full descriptions of the Annotations from a container, not just their IRIs.

OrderedAnnounceCollection
type: Class
comment: A collection of Actors.
subclass of: OrderedCollection
subclass of: Class
  type: Restriction
  onProperty: orderedItems
  someValuesFrom: Announce

Jurisdiction
type: Class
comment: The extent or range of judicial, law enforcement, or other authority.
subclass of: Location, Period, or Jurisdiction
date: 2008-01-14
Relation: Jurisdiction-001
Has Version: Jurisdiction-001
issued: 2008-01-14

less than
type: Property
comment: Specifies a property that must have smaller values than the value nodes.
range: Property

subPropertyOf
type: Property
comment: The subject is a subproperty of a property.
domain: Property
range: Property

Universal DID Resolver and Registrar
type: CompletedProject
type: Proposal
type: Project
proposal name: Universal DID Resolver and Registrar
proposal status: Complete
proposal website: danubetech.com
to fund: PET Fund

Free Software Vulnerability Database
type: Proposal
type: Project
proposal name: Free Software Vulnerability Database
proposal status: Selected
proposal website: vulnerablecode
to fund: PET Fund

externalDocumentRef
type: Property
type: ObjectProperty
comment: Identify any external SPDX documents referenced within this SPDX document.
domain: SpdxDocument
range: ExternalDocumentRef
term status: stable

Target type
type: Class
comment: The (meta) class for parameterizable targets. Instances of this are instantiated as values of the sh:target property.
subclass of: Class
subclass of: Parameterizable

annotatedSource
type: Property
comment: The property that determines the subject of an annotated axiom or annotated annotation.
domain: Resource

Datatype
type: Class
comment: The class of RDF datatypes.
subclass of: Class

intersectionOf
type: Property
comment: The property that determines the collection of classes or data ranges that build an intersection.
domain: Class
range: List

referenceLocator
type: Property
type: DatatypeProperty
comment: The unique string with no spaces necessary to access the package-specific information, metadata, or content within the target location. The format of the locator is subject to constraints defined by the <type>.
domain: ExternalRef
term status: stable

AllDisjointProperties
type: Class
comment: The class of collections of pairwise disjoint properties.
subclass of: Resource

Is Format Of
type: Property
comment: A related resource that is substantially the same as the described resource, but in another format.
comment: A pre-existing related resource that is substantially the same as the described resource, but in another format.
subPropertyOf: Relation
date: 2000-07-11
date: 2008-01-14
description: This property is intended to be used with non-literal values. This property is an inverse property of Has Format.
Relation: isFormatOf-003
Has Version: isFormatOf-003
issued: 2000-07-11
Date Modified: 2008-01-14
note: This term is intended to be used with non-literal values as defined in the DCMI Abstract Model (http://dublincore.org/documents/abstract-model/). As of December 2007, the DCMI Usage Board is seeking a way to express this intention with a formal range declaration.

FunctionalProperty
type: Class
comment: The class of functional properties.
subclass of: Property

styleClass
type: Property
comment: The name of the class used in the CSS description referenced from the Annotation that should be applied to the Specific Resource.
domain: SpecificResource

validator
type: Property
comment: The validator(s) used to evaluate constraints of either node or property shapes.
domain: Constraint component
range: Validator

disjoint
type: Property
comment: Specifies a property where the set of values must be disjoint with the value nodes.
range: Property

location
type: Property
type: ObjectProperty
comment: Indicates one or more physical or logical locations associated with the object.
domain: Object
range: Class
  unionOf: Object
  unionOf: Link

this
comment: A node expression that represents the current focus node.

oneOf
type: Property
type: ObjectProperty
comment: Describes a possible exclusive answer or option for a question.
domain: Question
range: Class
  unionOf: Object
  unionOf: Link

Democratic SendComm
type: RunningProject
type: Proposal
type: Project
proposal name: Democratic SendComm
proposal status: Running
proposal website: dsendcomm
to fund: NREN

Software Heritage
type: CompletedProject
type: Proposal
type: Project
proposal name: Software Heritage
proposal status: Complete
proposal website: www.softwareheritage.org
to fund: Discovery Fund

Kbin
type: RunningProject
type: Proposal
type: Project
proposal name: Kbin
proposal status: Running
proposal website: kbin.pub
to fund: Entrust Fund

uMap
type: RunningProject
type: Proposal
type: Project
proposal name: uMap
proposal status: Running
proposal website: UMap
to fund: Entrust Fund

provideClientKey
type: FunctionalProperty
type: Property
type: ObjectProperty
comment: If Linked Data Signatures and HTTP Signatures are being used for authentication and authorization, this endpoint specifies a URI at which a client key may be signed by the actor's key for a time window to act on behalf of the actor in interacting with foreign servers.
domain: Actor

Build Transparency (Trustix)
type: CompletedProject
type: Proposal
type: Project
proposal name: Build Transparency (Trustix)
proposal status: Complete
proposal website: build-transparency.org
to fund: PET Fund

Min-count constraint component
type: Parameterizable
type: Constraint component
comment: A constraint component that can be used to restrict the minimum number of value nodes.
parameter: MinCountConstraintComponent-minCount

Rotonda Secure Extensions
type: Proposal
type: Project
proposal name: Rotonda Secure Extensions
proposal status: Selected
proposal website: rotonda
to fund: Entrust Fund

return type
type: Property
comment: The expected type of values returned by the associated function.
domain: Function
range: Class

LiteX
type: RunningProject
type: Proposal
type: Project
proposal name: LiteX
proposal status: Running
proposal website: litex
to fund: Entrust Fund

Boris Villazón-Terrazas
type: Agent

DAVx⁵
type: RunningProject
type: Proposal
type: Project
proposal name: DAVx⁵
proposal status: Running
proposal website: www.davx5.com
to fund: Entrust Fund

Language-in constraint component
type: Parameterizable
type: Constraint component
comment: A constraint component that can be used to enumerate language tags that all value nodes must have.
parameter: LanguageInConstraintComponent-languageIn

Catalogs in MariaDB
type: Proposal
type: Project
proposal name: Catalogs in MariaDB
proposal status: Selected
proposal website: mariadb.org
to fund: Entrust Fund

fileType source
type: Thing
type: NamedIndividual
type: FileType
comment: Indicates the file is a source code file.
term status: stable

fileContributor
type: Property
type: DatatypeProperty
comment: This field provides a place for the SPDX file creator to record file contributors. Contributors could include names of copyright holders and/or authors who may not be copyright holders yet contributed to the file content.
domain: File
term status: stable

Back to source: trust but verify all the packages
type: RunningProject
type: Proposal
type: Project
proposal name: Back to source: trust but verify all the packages
proposal status: Running
proposal website: aboutcode.org
to fund: Entrust Fund

Privacy Preserving Disease Tracking
type: CompletedProject
type: Proposal
type: Project
proposal name: Privacy Preserving Disease Tracking
proposal status: Complete
proposal website: ppdt
to fund: Discovery Fund

min exclusive
type: Property
comment: Specifies the minimum exclusive value of each value node.

Ari
type: RunningProject
type: Proposal
type: Project
proposal name: Ari
proposal status: Running
proposal website: ari
to fund: Assure Fund

Tvix
type: RunningProject
type: Proposal
type: Project
proposal name: Tvix
proposal status: Running
proposal website: tvix
to fund: Assure Fund

Sequoia PGP
type: Proposal
type: Project
proposal name: Sequoia PGP
proposal status: Selected
proposal website: sequoia-pgp.org
to fund: Assure Fund

image
type: Property
type: ObjectProperty
comment: Indicates an entity that describes an image for this object. Unlike the icon property, there are no aspect ratio or display size limitations assumed.
domain: Object
range: Class
  unionOf: Image
  unionOf: Link

Listen
type: Class
comment: The actor listened to the object
subclass of: Activity

MeSH
type: VocabularyEncodingScheme
comment: The set of labeled concepts specified by the Medical Subject Headings.
date: 2008-01-14
date: 2000-07-11
Relation: MESH-003
Has Version: MESH-003
issued: 2000-07-11
Date Modified: 2008-01-14

closed
type: Property
comment: If set to true then the shape is closed.

onDataRange
type: Property
comment: The property that determines the data range that a qualified data cardinality restriction refers to.
domain: Restriction
range: Datatype

DCMI Period
type: Datatype
type: Class
comment: The set of time intervals defined by their limits according to the DCMI Period Encoding Scheme.
date: 2000-07-11
date: 2008-01-14
Relation: Period-003
Has Version: Period-003
issued: 2000-07-11
Date Modified: 2008-01-14

Librecast
type: RunningProject
type: Proposal
type: Project
proposal name: Librecast
proposal status: Running
proposal website: librecast.net
to fund: Assure Fund

Federated Timesheets
type: CompletedProject
type: Proposal
type: Project
proposal name: Federated Timesheets
proposal status: Complete
proposal website: timesheets
to fund: Assure Fund

Passthrough Authentication
type: RunningProject
type: Proposal
type: Project
proposal name: Passthrough Authentication
proposal status: Running
proposal website: PTA
to fund: Entrust Fund

relationshipType hasPrerequisite
type: RelationshipType
type: Thing
type: NamedIndividual
comment: Is to be used when SPDXRef-A has as a prerequisite SPDXRef-B.
term status: stable

JavaScript target
type: Class
comment: The class of targets that are based on JavaScript functions.
subclass of: JavaScript executable
subclass of: Target

mobile-nixos
type: CompletedProject
type: Proposal
type: Project
proposal name: mobile-nixos
proposal status: Complete
proposal website: mobile-nixos
to fund: PET Fund

Activity
type: Class
comment: An Object representing some form of Action that has been taken
subclass of: Object

IndieHosters
type: RunningProject
type: Proposal
type: Project
proposal name: IndieHosters
proposal status: Running
proposal website: indiehosters.net
to fund: Entrust Fund

sourceInfo
type: DatatypeProperty
type: Property
comment: Allows the producer(s) of the SPDX document to describe how the package was acquired and/or changed from the original source.
domain: Package
term status: stable

max inclusive
type: Property
comment: Specifies the maximum inclusive value of each value node.

Commune
type: RunningProject
type: Proposal
type: Project
proposal name: Commune
proposal status: Running
proposal website: commune.sh
to fund: Entrust Fund

externalDocumentId
type: Property
type: DatatypeProperty
comment: externalDocumentId is a string containing letters, numbers, ., - and/or + which uniquely identifies an external document within this document.
domain: ExternalDocumentRef
term status: stable

checksumAlgorithm md2
type: ChecksumAlgorithm
type: Thing
type: NamedIndividual
comment: Indicates the algorithm used was MD2
term status: stable

Interpeer SDKs
type: RunningProject
type: Proposal
type: Project
proposal name: Interpeer SDKs
proposal status: Running
proposal website: interpeer.io
to fund: Assure Fund

Accrual Policy
type: Property
comment: The policy governing the addition of items to a collection.
domain: Collection
range: Policy
range includes: Policy
date: 2010-10-11
date: 2005-06-13
description: Recommended practice is to use a value from the Collection Description Accrual Policy Vocabulary [[DCMI-ACCRUALPOLICY](https://dublincore.org/groups/collections/accrual-policy/)].
Relation: accrualPolicy-003
Has Version: accrualPolicy-003
issued: 2005-06-13
Date Modified: 2010-10-11

Fidus Writer
type: Proposal
type: Project
proposal name: Fidus Writer
proposal status: Selected
proposal website: www.fiduswriter.org
to fund: Entrust Fund

Relationship
type: Class
comment: Una classe di associazione per il collegamento di informazioni aggiuntive a una relazione tra le risorse DCAT. @it
comment: En associationsklasse til brug for tilknytning af yderligere information til en relation mellem DCAT-ressourcer. @da
comment: An association class for attaching additional information to a relationship between DCAT Resources.
comment: Asociační třída pro připojení dodatečných informací ke vztahu mezi zdroji DCAT. @cs
comment: Una clase de asociación para adjuntar información adicional a una relación entre recursos DCAT. @es
label: Relación @es
label: Vztah @cs
label: Relation @da
label: Relazione @it
change note: Ny klasse i DCAT 2.0. @da
change note: New class added in DCAT 2.0.
change note: Nová třída přidaná ve verzi DCAT 2.0. @cs
change note: Nueva clase añadida en DCAT 2.0. @es
change note: Nuova classe aggiunta in DCAT 2.0. @it
scope note: Viene utilizzato per caratterizzare la relazione tra insiemi di dati, e potenzialmente altri tipi di risorse, nei casi in cui la natura della relazione è nota ma non adeguatamente caratterizzata dalle proprietà dello standard 'Dublin Core' (dct:hasPart, dct:isPartOf, dct:conformsTo, dct:isFormatOf, dct:hasFormat, dct:isVersionOf, dct:hasVersion, dct:replaces, dct:isReplacedBy, dct:references, dct:isReferencedBy, dct:require, dct:isRequiredBy) o dalle propietà fornite da PROV-O (prov:wasDerivedFrom, prov:wasInfluencedBy, prov:wasQuotedFrom, prov:wasRevisionOf, prov: hadPrimarySource, prov:alternateOf, prov:specializationOf). @it
scope note: Používá se pro charakterizaci vztahu mezi datovými sadami a případně i jinými zdroji, kde druh vztahu je sice znám, ale není přiměřeně charakterizován standardními vlastnostmi slovníku Dublin Core (dct:hasPart, dct:isPartOf, dct:conformsTo, dct:isFormatOf, dct:hasFormat, dct:isVersionOf, dct:hasVersion, dct:replaces, dct:isReplacedBy, dct:references, dct:isReferencedBy, dct:requires, dct:isRequiredBy) či vlastnostmi slovníku PROV-O (prov:wasDerivedFrom, prov:wasInfluencedBy, prov:wasQuotedFrom, prov:wasRevisionOf, prov:hadPrimarySource, prov:alternateOf, prov:specializationOf). @cs
scope note: Anvendes til at karakterisere en relation mellem datasæt, og potentielt andre ressourcer, hvor relationen er kendt men ikke tilstrækkeligt beskrevet af de standardiserede egenskaber i Dublin Core (dct:hasPart, dct:isPartOf, dct:conformsTo, dct:isFormatOf, dct:hasFormat, dct:isVersionOf, dct:hasVersion, dct:replaces, dct:isReplacedBy, dct:references, dct:isReferencedBy, dct:requires, dct:isRequiredBy) eller PROV-O-egenskaber (prov:wasDerivedFrom, prov:wasInfluencedBy, prov:wasQuotedFrom, prov:wasRevisionOf, prov:hadPrimarySource, prov:alternateOf, prov:specializationOf). @da
scope note: Use to characterize a relationship between datasets, and potentially other resources, where the nature of the relationship is known but is not adequately characterized by the standard Dublin Core properties (dct:hasPart, dct:isPartOf, dct:conformsTo, dct:isFormatOf, dct:hasFormat, dct:isVersionOf, dct:hasVersion, dct:replaces, dct:isReplacedBy, dct:references, dct:isReferencedBy, dct:requires, dct:isRequiredBy) or PROV-O properties (prov:wasDerivedFrom, prov:wasInfluencedBy, prov:wasQuotedFrom, prov:wasRevisionOf, prov:hadPrimarySource, prov:alternateOf, prov:specializationOf).
scope note: Se usa para caracterizar la relación entre conjuntos de datos, y potencialmente otros recursos, donde la naturaleza de la relación se conoce pero no está caracterizada adecuadamente con propiedades del estándar 'Dublin Core' (dct:hasPart, dct:isPartOf, dct:conformsTo, dct:isFormatOf, dct:hasFormat, dct:isVersionOf, dct:hasVersion, dct:replaces, dct:isReplacedBy, dct:references, dct:isReferencedBy, dct:requires, dct:isRequiredBy) or PROV-O properties (prov:wasDerivedFrom, prov:wasInfluencedBy, prov:wasQuotedFrom, prov:wasRevisionOf, prov:hadPrimarySource, prov:alternateOf, prov:specializationOf). @es

first
type: Property
comment: The first item in the subject RDF list.
domain: List

Betrusted Storage
type: CompletedProject
type: Proposal
type: Project
proposal name: Betrusted Storage
proposal status: Complete
proposal website: betrusted.io
to fund: PET Fund

WireGuard on FPGA
type: Proposal
type: Project
proposal name: WireGuard on FPGA
proposal status: Selected
proposal website: BlackwireOverview
to fund: Entrust Fund

licenseConcluded
type: FunctionalProperty
type: Property
type: ObjectProperty
comment: The licensing that the preparer of this SPDX document has concluded, based on the evidence, actually applies to the SPDX Item. If the licenseConcluded field is not present for an SPDX Item, it implies an equivalent meaning to NOASSERTION.
domain: SpdxItem
range: Class
  unionOf: AnyLicenseInfo
  unionOf: Class
    type: Restriction
    hasValue: noassertion
    onProperty: licenseConcluded
  unionOf: Class
    type: Restriction
    hasValue: none
    onProperty: licenseConcluded
term status: stable

Mox
type: RunningProject
type: Proposal
type: Project
proposal name: Mox
proposal status: Running
proposal website: mox
to fund: Entrust Fund

group
type: Property
comment: Can be used to link to a property group to indicate that a property shape belongs to a group of related property shapes.
domain: Property shape
range: Property group

ARPA2 LDAP Middleware
type: CompletedProject
type: Proposal
type: Project
proposal name: ARPA2 LDAP Middleware
proposal status: Complete
proposal website: arpa2.net
to fund: PET Fund

releaseDate
type: DatatypeProperty
type: Property
comment: This field provides a place for recording the date the package was released.
domain: Package
range: dateTime
subPropertyOf: date
term status: stable

Marginalia Search
type: RunningProject
type: Proposal
type: Project
proposal name: Marginalia Search
proposal status: Running
proposal website: search.marginalia.nu
to fund: Entrust Fund

node-Tor
type: CompletedProject
type: Proposal
type: Project
proposal name: node-Tor
proposal status: Complete
proposal website: node-Tor
to fund: PET Fund

In constraint component
type: Parameterizable
type: Constraint component
comment: A constraint component that can be used to exclusively enumerate the permitted value nodes.
parameter: InConstraintComponent-in

uploadMedia
type: Property
type: DatatypeProperty
comment: Servers MAY support uploading document types to be referenced in activites, such as images, video or other binary data, but the precise mechanism is out of scope for this version of ActivityPub.
domain: Object
range: anyUri

Location, Period, or Jurisdiction
type: Class
comment: A location, period of time, or jurisdiction.
date: 2008-01-14
Relation: LocationPeriodOrJurisdiction-001
Has Version: LocationPeriodOrJurisdiction-001
issued: 2008-01-14

Size or Duration
type: Class
comment: A dimension or extent, or a time taken to play or execute.
subclass of: Media Type or Extent
date: 2008-01-14
description: Examples include a number of pages, a specification of length, width, and breadth, or a period in hours, minutes, and seconds.
Relation: SizeOrDuration-001
Has Version: SizeOrDuration-001
issued: 2008-01-14

Subject
type: Property
comment: The topic of the resource.
comment: A topic of the resource.
subPropertyOf: Subject
date: 2012-06-14
date: 2008-01-14
description: Recommended practice is to refer to the subject with a URI. If this is not possible or feasible, a literal value that identifies the subject may be provided. Both should preferably refer to a subject in a controlled vocabulary.
description: Typically, the subject will be represented using keywords, key phrases, or classification codes. Recommended best practice is to use a controlled vocabulary.
Relation: subjectT-002
Has Version: subjectT-002
issued: 2008-01-14
Date Modified: 2012-06-14
note: This term is intended to be used with non-literal values as defined in the DCMI Abstract Model (http://dublincore.org/documents/abstract-model/). As of December 2007, the DCMI Usage Board is seeking a way to express this intention with a formal range declaration.

purpose library
type: Purpose
type: Thing
type: NamedIndividual
comment: The package is a software library.
term status: stable

name
type: DatatypeProperty
type: Property
comment: Identify name of this SpdxElement.
domain: SpdxElement
term status: stable

Sylk Mobile
type: CompletedProject
type: Proposal
type: Project
proposal name: Sylk Mobile
proposal status: Complete
proposal website: sylkserver.com
to fund: PET Fund

Maemo Leste Telepathy
type: RunningProject
type: Proposal
type: Project
proposal name: Maemo Leste Telepathy
proposal status: Running
proposal website: maemo-leste.github.io
to fund: Assure Fund

Fix the Pitch Black Attack in Freenet routing
type: Proposal
type: Project
proposal name: Fix the Pitch Black Attack in Freenet routing
proposal status: Selected
proposal website: www.freenetproject.org
to fund: PET Fund

SASL Works for the InternetWide Architecture
type: CompletedProject
type: Proposal
type: Project
proposal name: SASL Works for the InternetWide Architecture
proposal status: Complete
proposal website: internetwide.org
to fund: PET Fund

JSON
type: Class
type: Datatype
comment: The datatype of RDF literals storing JSON content.
subclass of: Literal

Format
type: Property
comment: The file format, physical medium, or dimensions of the resource.
range: Media Type or Extent
subPropertyOf: Format
range includes: Media Type
range includes: Extent
date: 2008-01-14
description: Recommended practice is to use a controlled vocabulary where available. For example, for file formats one could use the list of Internet Media Types [[MIME](https://www.iana.org/assignments/media-types/media-types.xhtml)]. Examples of dimensions include size and duration.
description: Examples of dimensions include size and duration. Recommended best practice is to use a controlled vocabulary such as the list of Internet Media Types [MIME].
Relation: formatT-001
Has Version: formatT-001
issued: 2008-01-14
Date Modified: 2008-01-14

A Secret Key Store for Sequoia PGP
type: RunningProject
type: Proposal
type: Project
proposal name: A Secret Key Store for Sequoia PGP
proposal status: Running
proposal website: sequoia-pgp.org
to fund: Assure Fund

rasn
type: CompletedProject
type: Proposal
type: Project
proposal name: rasn
proposal status: Complete
proposal website: rasn
to fund: Assure Fund

relationshipType describes
type: RelationshipType
type: Thing
type: NamedIndividual
comment: Is to be used when SPDXRef-DOCUMENT describes SPDXRef-A.
term status: stable

referenceCategory other
type: ReferenceCategory
type: Thing
type: NamedIndividual
term status: stable

Pitchfork
type: CompletedProject
type: Proposal
type: Project
proposal name: Pitchfork
proposal status: Complete
proposal website: pitchfork.ist
to fund: InternetHardeningFund

targetValue
type: Property
comment: The property that determines the value of a negative data property assertion.
domain: NegativePropertyAssertion

Machdyne
type: RunningProject
type: Proposal
type: Project
proposal name: Machdyne
proposal status: Running
proposal website: machdyne.com
to fund: Entrust Fund

CreationInfo
type: Class
comment: One instance is required for each SPDX file produced. It provides the necessary information for forward and backward compatibility for processing tools.
subclass of: Class
  type: Restriction
  maxQualifiedCardinality: 1
  onDataRange: string
  onProperty: comment
subclass of: Class
  type: Restriction
  minQualifiedCardinality: 1
  onDataRange: string
  onProperty: creator
subclass of: Class
  type: Restriction
  onDataRange: dateTimeStamp
  onProperty: created
  qualifiedCardinality: 1
subclass of: Class
  type: Restriction
  maxQualifiedCardinality: 1
  onDataRange: string
  onProperty: licenseListVersion
term status: stable

datasæt
type: ObjectProperty
type: Property
comment: Συνδέει έναν κατάλογο με ένα σύνολο δεδομένων το οποίο ανήκει στον εν λόγω κατάλογο. @el
comment: Relie un catalogue à un jeu de données faisant partie de ce catalogue. @fr
comment: カタログの一部であるデータセット。 @ja
comment: A collection of data that is listed in the catalog.
comment: En samling af data som er opført i kataloget. @da
comment: تربط الفهرس بقائمة بيانات ضمنه @ar
comment: Un conjunto de datos que se lista en el catálogo. @es
comment: Una raccolta di dati che è elencata nel catalogo. @it
comment: Kolekce dat, která je katalogizována v katalogu. @cs
domain: Catalog
label: データセット @ja
label: jeu de données @fr
label: dataset
label: datová sada @cs
label: conjunto de datos @es
label: قائمة بيانات @ar
label: σύνολο δεδομένων @el
range: Dataset
subPropertyOf: Has Part
subPropertyOf: member
alternative label: datasamling @da
alternative label: har datasæt @da
editorial note: Status: English Definition text modified by DCAT revision team, Italian, Spanish and Czech translation provided, other translations pending.

Abstract
type: Property
comment: A summary of the resource.
subPropertyOf: Description
date: 2000-07-11
date: 2008-01-14
Relation: abstract-003
Has Version: abstract-003
issued: 2000-07-11
Date Modified: 2008-01-14

Motivation
type: Class
comment: The Motivation class is used to record the user's intent or motivation for the creation of the Annotation, or the inclusion of the body or target, that it is associated with.
subclass of: Concept

Balthazar Casing
type: RunningProject
type: Proposal
type: Project
proposal name: Balthazar Casing
proposal status: Running
proposal website: balthazar.space
to fund: Entrust Fund

SPARQL ASK executable
type: Class
comment: The class of SPARQL executables that are based on an ASK query.
subclass of: SPARQL executable

Solid-NextCloud app
type: CompletedProject
type: Proposal
type: Project
proposal name: Solid-NextCloud app
proposal status: Complete
proposal website: www.muze.nl
to fund: Discovery Fund

Max-length constraint component
type: Parameterizable
type: Constraint component
comment: A constraint component that can be used to restrict the maximum string length of value nodes.
parameter: MaxLengthConstraintComponent-maxLength

Atomic Data
type: CompletedProject
type: Proposal
type: Project
proposal name: Atomic Data
proposal status: Complete
proposal website: atomicdata.dev
to fund: Assure Fund

oauthTokenEndpoint
type: FunctionalProperty
type: Property
type: ObjectProperty
comment: If OAuth 2.0 bearer tokens [RFC6749] [RFC6750] are being used for authenticating client to server interactions, this endpoint specifies a URI at which a client may acquire an access token.
domain: Actor

theme
type: ObjectProperty
type: Property
comment: Η κύρια κατηγορία του συνόλου δεδομένων. Ένα σύνολο δεδομένων δύναται να έχει πολλαπλά θέματα. @el
comment: データセットの主要カテゴリー。データセットは複数のテーマを持つことができます。 @ja
comment: La catégorie principale de la ressource. Une ressource peut avoir plusieurs thèmes. @fr
comment: Et centralt emne for ressourcen. En ressource kan have flere centrale emner. @da
comment: التصنيف الرئيسي لقائمة البيانات. قائمة البيانات يمكن أن تملك أكثر من تصنيف رئيسي واحد. @ar
comment: A main category of the resource. A resource can have multiple themes.
comment: La categoría principal del recurso. Un recurso puede tener varios temas. @es
comment: Hlavní téma zdroje. Zdroj může mít více témat. @cs
comment: La categoria principale della risorsa. Una risorsa può avere più temi. @it
label: thème @fr
label: التصنيف @ar
label: téma @cs
label: テーマ/カテゴリー @ja
label: tema @it
label: Θέμα @el
label: emne @da
range: Concept
subPropertyOf: Subject
editorial note: Status: English Definition text modified by DCAT revision team, all except for Italian and Czech translations are pending.
scope note: Το σετ των skos:Concepts που χρησιμοποιείται για να κατηγοριοποιήσει τα σύνολα δεδομένων είναι οργανωμένο εντός ενός skos:ConceptScheme που περιγράφει όλες τις κατηγορίες και τις σχέσεις αυτών στον κατάλογο. @el
scope note: The set of skos:Concepts used to categorize the resources are organized in a skos:ConceptScheme describing all the categories and their relations in the catalog.
scope note: Un ensemble de skos:Concepts utilisés pour catégoriser les ressources sont organisés en un skos:ConceptScheme décrivant toutes les catégories et ses relations dans le catalogue. @fr
scope note: Samlingen af begreber (skos:Concept) der anvendes til at emneinddele ressourcer organiseres i et begrebssystem (skos:ConceptScheme) som beskriver alle emnerne og deres relationer i kataloget. @da
scope note: Il set di concetti skos usati per categorizzare le risorse sono organizzati in skos:ConceptScheme che descrive tutte le categorie e le loro relazioni nel catalogo. @it
scope note: Sada instancí třídy skos:Concept použitá pro kategorizaci zdrojů je organizována do schématu konceptů skos:ConceptScheme, které popisuje všechny kategorie v katalogu a jejich vztahy. @cs
scope note: データセットを分類するために用いられるskos:Conceptの集合は、カタログのすべてのカテゴリーとそれらの関係を記述しているskos:ConceptSchemeで組織化されます。 @ja
scope note: El conjunto de skos:Concepts utilizados para categorizar los recursos están organizados en un skos:ConceptScheme que describe todas las categorías y sus relaciones en el catálogo. @es

relationshipType dependsOn
type: RelationshipType
type: Thing
type: NamedIndividual
comment: Is to be used when SPDXRef-A depends on SPDXRef-B.
term status: stable

predicate
type: Property
comment: An expression producing the properties that shall be inferred as predicates.
domain: A rule based on triple (subject, predicate, object) pattern.

Nyxt
type: CompletedProject
type: Proposal
type: Project
proposal name: Nyxt
proposal status: Complete
proposal website: nyxt.atlas.engineer
to fund: Discovery Fund

AALT (Accelerated Analog Layout Tool)
type: RunningProject
type: Proposal
type: Project
proposal name: AALT (Accelerated Analog Layout Tool)
proposal status: Running
proposal website: aalt
to fund: Entrust Fund

accuracy
type: FunctionalProperty
type: Property
type: DatatypeProperty
comment: Specifies the accuracy around the point established by the longitude and latitude
domain: Place
range: Class
  type: Datatype
  onDatatype: float
  withRestrictions:
    min inclusive: 0.0

byte size
type: Property
type: DatatypeProperty
comment: El tamaño de una distribución en bytes. @es
comment: La dimensione di una distribuzione in byte. @it
comment: Størrelsen af en distributionen angivet i bytes. @da
comment: La taille de la distribution en octects @fr
comment: バイトによる配信のサイズ。 @ja
comment: Velikost distribuce v bajtech. @cs
comment: The size of a distribution in bytes.
comment: Το μέγεθος μιας διανομής σε bytes. @el
comment: الحجم بالبايتات @ar
domain: Distribution
label: bytestørrelse @da
label: taille en octects @fr
label: バイト・サイズ @ja
label: الحجم بالبايت @ar
label: dimensione in byte @it
label: tamaño en bytes @es
label: velikost v bajtech @cs
label: μέγεθος σε bytes @el
definition: La taille de la distribution en octects. @fr
definition: Størrelsen af en distribution angivet i bytes. @da
scope note: La dimensione in byte può essere approssimata quando non si conosce la dimensione precisa. Il valore di dcat:byteSize dovrebbe essere espresso come un xsd:decimal. @it
scope note: The size in bytes can be approximated when the precise size is not known. The literal value of dcat:byteSize should by typed as xsd:decimal.
scope note: La taille en octects peut être approximative lorsque l'on ignore la taille réelle. La valeur littérale de dcat:byteSize doit être de type xsd:decimal. @fr
scope note: 正確なサイズが不明である場合、サイズは、バイトによる近似値を示すことができます。 @ja
scope note: El tamaño en bytes puede ser aproximado cuando se desconoce el tamaño exacto. El valor literal de dcat:byteSize debe tener tipo 'xsd:decimal'. @es
scope note: Velikost v bajtech může být přibližná, pokud její přesná hodnota není známa. Literál s hodnotou dcat:byteSize by měl mít datový typ xsd:decimal. @cs
scope note: Bytestørrelsen kan approximeres hvis den præcise størrelse ikke er kendt. Værdien af dcat:byteSize bør angives som xsd:decimal. @da
scope note: الحجم يمكن أن يكون تقريبي إذا كان الحجم الدقيق غير معروف @ar
scope note: Το μέγεθος σε bytes μπορεί να προσεγγιστεί όταν η ακριβής τιμή δεν είναι γνωστή. Η τιμή της dcat:byteSize θα πρέπει να δίνεται με τύπο δεδομένων xsd:decimal. @el

Accrual Method
type: Property
comment: The method by which items are added to a collection.
domain: Collection
range: Method of Accrual
range includes: Method of Accrual
date: 2010-10-11
date: 2005-06-13
description: Recommended practice is to use a value from the Collection Description Accrual Method Vocabulary [[DCMI-ACCRUALMETHOD](https://dublincore.org/groups/collections/accrual-method/)].
Relation: accrualMethod-003
Has Version: accrualMethod-003
issued: 2005-06-13
Date Modified: 2010-10-11

allValuesFrom
type: Property
comment: The property that determines the class that a universal property restriction refers to.
domain: Restriction
range: Class

Briar Desktop
type: CompletedProject
type: Proposal
type: Project
proposal name: Briar Desktop
proposal status: Complete
proposal website: briarproject.org
to fund: Assure Fund

KDE Plasma Wayland
type: Proposal
type: Project
proposal name: KDE Plasma Wayland
proposal status: Selected
proposal website: plasma-desktop
to fund: Core Fund

Namecoin: TLS
type: CompletedProject
type: Proposal
type: Project
proposal name: Namecoin: TLS
proposal status: Complete
proposal website: www.namecoin.org
to fund: InternetHardeningFund

min length
type: Property
comment: Specifies the minimum string length of each value node.

Inventaire Self-hosted
type: RunningProject
type: Proposal
type: Project
proposal name: Inventaire Self-hosted
proposal status: Running
proposal website: inventaire.io
to fund: Entrust Fund

Overte
type: RunningProject
type: Proposal
type: Project
proposal name: Overte
proposal status: Running
proposal website: overte.org
to fund: Entrust Fund

Property constraint component
type: Parameterizable
type: Constraint component
comment: A constraint component that can be used to verify that all value nodes conform to the given property shape.
parameter: PropertyConstraintComponent-property

deleted
type: FunctionalProperty
type: Property
type: DatatypeProperty
comment: Specifies the date and time the object was deleted
domain: Tombstone
range: dateTime

filter shape
type: Property
comment: The shape that all input nodes of the expression need to conform to.
range: Shape

IMSI Pseudonymization
type: CompletedProject
type: Proposal
type: Project
proposal name: IMSI Pseudonymization
proposal status: Complete
proposal website: osmocom.org
to fund: PET Fund

fileType text
type: Thing
type: NamedIndividual
type: FileType
comment: The file is human readable text file (MIME type of text/*).
term status: stable

TextPositionSelector
type: Class
comment: The TextPositionSelector describes a range of text by recording the start and end positions of the selection in the stream. Position 0 would be immediately before the first character, position 1 would be immediately before the second character, and so on.
subclass of: Selector

match
type: Property
type: DatatypeProperty
comment: Status of a License List SeeAlso URL reference if it refers to a website that matches the license text.
domain: CrossRef

MNT Reform
type: Proposal
type: Project
type: CompletedProject
proposal name: MNT Reform
proposal status: Complete
proposal website: 2020-05-08-the-much-more-personal-computer.html
proposal website: mntre.com
to fund: PET Fund

FileSender UX ZIP
type: Proposal
type: Project
proposal name: FileSender UX ZIP
proposal status: Selected
proposal website: filesender.org
to fund: FileSender

Info
type: Severity
comment: The severity for an informational validation result.

TentativeReject
type: Class
comment: Actor tentatively rejects the object
subclass of: Reject

qualified value shape
type: Property
comment: The shape that a specified number of values must conform to.
range: Shape

preview
type: Property
type: ObjectProperty
comment: Identifies an entity that provides a preview of this object.
domain: Class
  unionOf: Object
  unionOf: Link
range: Class
  unionOf: Object
  unionOf: Link

CompoundPointer
type: Class
subclass of: Pointer
term status: stable

Audio
type: Class
comment: An audio file
subclass of: Document

purpose operatingSystem
type: Purpose
type: Thing
type: NamedIndividual
comment: The package refers to an operating system.
term status: stable

construct
type: Property
comment: The SPARQL CONSTRUCT query to execute.
domain: SPARQL CONSTRUCT executable

relationshipType staticLink
type: RelationshipType
type: Thing
type: NamedIndividual
comment: Is to be used when SPDXRef-A statically links to SPDXRef-B.
term status: stable

union
type: Property
comment: A list of node expressions that shall be used together.

url
type: Property
type: DatatypeProperty
comment: URL Reference
domain: CrossRef

less-than-or-equals constraint component
type: Parameterizable
type: Constraint component
comment: A constraint component that can be used to verify that every value node is smaller than all the nodes that have the focus node as subject and the value of a given property as predicate.
parameter: LessThanOrEqualsConstraintComponent-lessThanOrEquals

Solid Application Interoperability
type: CompletedProject
type: Proposal
type: Project
proposal name: Solid Application Interoperability
proposal status: Complete
proposal website: specification
to fund: Discovery Fund

Keyoxide v2
type: RunningProject
type: Proposal
type: Project
proposal name: Keyoxide v2
proposal status: Running
proposal website: keyoxide.org
to fund: Assure Fund

ExternalRef
type: Class
comment: An External Reference allows a Package to reference an external source of additional information, metadata, enumerations, asset identifiers, or downloadable content believed to be relevant to the Package.
subclass of: Class
  type: Restriction
  maxQualifiedCardinality: 1
  onDataRange: string
  onProperty: comment
subclass of: Class
  type: Restriction
  onDataRange: anyURI
  onProperty: referenceLocator
  qualifiedCardinality: 1
subclass of: Class
  type: Restriction
  onClass: ReferenceType
  onProperty: referenceType
  qualifiedCardinality: 1
subclass of: Class
  type: Restriction
  onClass: ReferenceCategory
  onProperty: referenceCategory
  qualifiedCardinality: 1
term status: stable

Article
type: Class
comment: A written work. Typically several paragraphs long. For example, a blog post or a news article.
subclass of: Object

Class
type: Restriction
qualifiedCardinality: 1

Severity
type: Class
comment: The class of validation result severity levels, including violation and warning levels.
subclass of: Resource

licenseText
type: Property
type: DatatypeProperty
comment: Full text of the license.
domain: License
term status: stable

Privacy Infrastructure for Corteza Federations
type: CompletedProject
type: Proposal
type: Project
proposal name: Privacy Infrastructure for Corteza Federations
proposal status: Complete
proposal website: www.cortezaproject.org
to fund: Discovery Fund

TLS-KDH
type: CompletedProject
type: Proposal
type: Project
proposal name: TLS-KDH
proposal status: Complete
proposal website: tls-kdh.arpa2.net
to fund: InternetHardeningFund

Min-inclusive constraint component
type: Parameterizable
type: Constraint component
comment: A constraint component that can be used to restrict the range of value nodes with a minimum inclusive value.
parameter: MinInclusiveConstraintComponent-minInclusive

EEZ Studio
type: CompletedProject
type: Proposal
type: Project
proposal name: EEZ Studio
proposal status: Complete
proposal website: www.envox.eu
to fund: Entrust Fund

purpose firmware
type: Purpose
type: Thing
type: NamedIndividual
comment: The package provides low level control over a device's hardware.
term status: stable

x86-64 VM Monitor for seL4 verified microkernel
type: Proposal
type: Project
proposal name: x86-64 VM Monitor for seL4 verified microkernel
proposal status: Selected
proposal website: sel4.systems
to fund: PET Fund

Audience
type: Property
comment: A class of entity for whom the resource is intended or useful.
comment: A class of agents for whom the resource is intended or useful.
range: Agent Class
range includes: Agent Class
date: 2008-01-14
date: 2001-05-21
description: Recommended practice is to use this property with non-literal values from a vocabulary of audience types.
Relation: audience-003
Has Version: audience-003
issued: 2001-05-21
Date Modified: 2008-01-14

Exactly one constraint component
type: Parameterizable
type: Constraint component
comment: A constraint component that can be used to restrict the value nodes so that they conform to exactly one out of several provided shapes.
parameter: XoneConstraintComponent-xone

fileType other
type: Thing
type: NamedIndividual
type: FileType
comment: Indicates the file is not a source, archive or binary file.
term status: stable

packaging format
type: Property
type: ObjectProperty
comment: Format til pakning af data med henblik på distribution af en eller flere relaterede datafiler der samles til en enhed med henblik på samlet distribution. @da
comment: El formato del archivo en que se agrupan uno o más archivos de datos, e.g. para permitir que un conjunto de archivos relacionados se bajen juntos. @es
comment: Il formato di impacchettamento della distribuzione in cui uno o più file di dati sono raggruppati insieme, ad es. per abilitare un insieme di file correlati da scaricare insieme. @it
comment: Balíčkový formát souboru, ve kterém je jeden či více souborů seskupeno dohromady, např. aby bylo možné stáhnout sadu souvisejících souborů naráz. @cs
comment: The package format of the distribution in which one or more data files are grouped together, e.g. to enable a set of related files to be downloaded together.
domain: Distribution
label: formato de empaquetado @es
label: pakkeformat @da
label: formato di impacchettamento @it
label: formát balíčku @cs
range: Media Type
subPropertyOf: Format
change note: Nuova proprietà aggiunta in DCAT 2.0. @it
change note: Nueva propiedad agregada en DCAT 2.0. @es
change note: New property added in DCAT 2.0.
change note: Nová vlastnost přidaná ve verzi DCAT 2.0. @cs
change note: Ny egenskab tilføjet i DCAT 2.0. @da
scope note: Tato vlastnost se použije, když jsou soubory v distribuci zabaleny, např. v souboru TAR, v balíčku Frictionless Data Package nebo v souboru Bagit. Formát BY MĚL být vyjádřen pomocí typu média definovaného v registru IANA https://www.iana.org/assignments/media-types/, pokud existuje. @cs
scope note: This property to be used when the files in the distribution are packaged, e.g. in a TAR file, a Frictionless Data Package or a Bagit file. The format SHOULD be expressed using a media type as defined by IANA media types registry https://www.iana.org/assignments/media-types/, if available.
scope note: Denne egenskab kan anvendes hvis filerne i en distribution er pakket, fx i en TAR-fil, en Frictionless Data Package eller en Bagit-fil. Formatet BØR udtrykkes ved en medietype som defineret i 'IANA media types registry', hvis der optræder en relevant medietype dér: https://www.iana.org/assignments/media-types/. @da
scope note: Esta propiedad se debe usar cuando los archivos de la distribución están empaquetados, por ejemplo en un archivo TAR, Frictionless Data Package o Bagit. El formato DEBERÍA expresarse usando un 'media type', tales como los definidos en el registro IANA de 'media types' https://www.iana.org/assignments/media-types/, si está disponibles. @es
scope note: Questa proprietà deve essere utilizzata quando i file nella distribuzione sono impacchettati, ad esempio in un file TAR, Frictionless Data Package o Bagit. Il formato DOVREBBE essere espresso utilizzando un tipo di supporto come definito dal registro dei tipi di media IANA https://www.iana.org/assignments/media-types/, se disponibili. @it

label
type: Property
comment: A human-readable name for the subject.
domain: Resource

DMT
type: RunningProject
type: Proposal
type: Project
proposal name: DMT
proposal status: Running
proposal website: dmt-core
to fund: Entrust Fund

distribuce
type: ObjectProperty
type: Property
comment: Συνδέει ένα σύνολο δεδομένων με μία από τις διαθέσιμες διανομές του. @el
comment: Dostupná distribuce datové sady. @cs
comment: データセットを、その利用可能な配信に接続します。 @ja
comment: تربط قائمة البيانات بطريقة أو بشكل يسمح الوصول الى البيانات @ar
comment: Una distribuzione disponibile per il set di dati. @it
comment: En tilgængelig repræsentation af datasættet. @da
comment: An available distribution of the dataset.
comment: Una distribución disponible del conjunto de datos. @es
comment: Connecte un jeu de données à des distributions disponibles. @fr
domain: Dataset
label: distribución @es
label: توزيع @ar
label: διανομή @el
label: distribuzione @it
label: distribution
label: データセット配信 @ja
range: Distribution
subPropertyOf: Relation
alternative label: har distribution @da
editorial note: Status: English Definition text modified by DCAT revision team, translations pending (except for Italian, Spanish and Czech).

MinExclusiveConstraintComponent-minExclusive
type: Shape
type: Property shape
type: Parameter
max count: 1
node kind: Literal
path: min exclusive

CryptPad Auth
type: RunningProject
type: Proposal
type: Project
proposal name: CryptPad Auth
proposal status: Running
proposal website: cryptpad.fr
to fund: Assure Fund

predicate
type: Property
comment: The predicate of the subject RDF statement.
domain: Statement

Wireguard Windows client
type: CompletedProject
type: Proposal
type: Project
proposal name: Wireguard Windows client
proposal status: Complete
proposal website: www.wireguard.com
to fund: VPN Fund

Open Know-How Search
type: CompletedProject
type: Proposal
type: Project
proposal name: Open Know-How Search
proposal status: Complete
proposal website: openknowhow.org
to fund: Discovery Fund

ContainerMembershipProperty
type: Class
comment: The class of container membership properties, rdf:_1, rdf:_2, ..., all of which are sub-properties of 'member'.
subclass of: Property

annotation value
type: Property
comment: The (default) values of the annotation property.
domain: Result annotation

sourcehut
type: CompletedProject
type: Proposal
type: Project
proposal name: sourcehut
proposal status: Complete
proposal website: sourcehut.org
to fund: Discovery Fund

Discovery Fund
fund label: NGI0 Discovery
proposals accepted: 148
proposals submitted: 781

Whippet
type: Proposal
type: Project
proposal name: Whippet
proposal status: Selected
proposal website: whippet
to fund: Core Fund

Selector
type: Class
comment: A resource which describes the segment of interest in a representation of a Source resource, indicated with oa:hasSelector from the Specific Resource. This class is not used directly in the Annotation model, only its subclasses.

service end-point
type: Property
type: ObjectProperty
comment: Rodplaceringen eller det primære endpoint for en tjeneste (en web-resolverbar IRI). @da
comment: Kořenové umístění nebo hlavní přístupový bod služby (IRI přístupné přes Web). @cs
comment: The root location or primary endpoint of the service (a web-resolvable IRI).
comment: La locazione principale o l'endpoint primario del servizio (un IRI risolvibile via web). @it
comment: La posición raíz o end-point principal del servicio (una IRI web). @es
domain: Data service
label: tjenesteendpoint @da
label: přístupový bod služby @cs
label: end-point del servicio @es
label: end-point del servizio @it
change note: New property in DCAT 2.0.
change note: Nová vlastnost přidaná ve verzi DCAT 2.0. @cs
change note: Nuova proprietà in DCAT 2.0. @it
change note: Nueva propiedad agregada en DCAT 2.0. @es

declare
type: Property
comment: Links a resource with its namespace prefix declarations.
domain: Ontology
range: Prefix declaration

hasPurpose
type: Property
comment: The purpose served by the resource in the Annotation.
range: Motivation

deprecated
type: Property
type: AnnotationProperty
comment: The annotation property that indicates that a given entity has been deprecated.
domain: Resource

equals
type: Property
comment: Specifies a property that must have the same values as the value nodes.
range: Property

oauthAuthorizationEndpoint
type: FunctionalProperty
type: Property
type: ObjectProperty
comment: If OAuth 2.0 bearer tokens [RFC6749] [RFC6750] are being used for authenticating client to server interactions, this endpoint specifies a URI at which a browser-authenticated user may obtain a new authorization grant.
domain: Actor

Date Accepted
type: Property
comment: Date of acceptance of the resource.
subPropertyOf: Date
date: 2002-07-13
date: 2008-01-14
description: Examples of resources to which a Date Accepted may be relevant are a thesis (accepted by a university department) or an article (accepted by a journal).
description: Recommended practice is to describe the date, date/time, or period of time as recommended for the property Date, of which this is a subproperty. Examples of resources to which a date of acceptance may be relevant are a thesis (accepted by a university department) or an article (accepted by a journal).
Relation: dateAccepted-002
Has Version: dateAccepted-002
issued: 2002-07-13
Date Modified: 2008-01-14

Spectrum Wayland
type: CompletedProject
type: Proposal
type: Project
proposal name: Spectrum Wayland
proposal status: Complete
proposal website: spectrum-os.org
to fund: PET Fund

Link
type: Class
comment: Represents a qualified reference to another resource. Patterned after the RFC5988 Web Linking Model
disjointWith: Object

postmarketOS: v23.12 and v24.06 Releases
type: RunningProject
type: Proposal
type: Project
proposal name: postmarketOS: v23.12 and v24.06 Releases
proposal status: Running
proposal website: postmarketos.org
to fund: Core Fund

MEGA65 Phone
type: CompletedProject
type: Proposal
type: Project
proposal name: MEGA65 Phone
proposal status: Complete
proposal website: mega65.org
to fund: PET Fund

parameter
type: Property
comment: The parameters of a function or constraint component.
domain: Parameterizable
range: Parameter

via
type: Property
comment: A object of the relationship is a resource from which the source resource was retrieved by the providing system.

Magic Wormhole/SPAKE2
type: Proposal
type: Project
proposal name: Magic Wormhole/SPAKE2
proposal status: Selected
proposal website: magic-wormhole
to fund: InternetHardeningFund

Publisher
type: Property
comment: An entity responsible for making the resource available.
range: Agent
subPropertyOf: Publisher
range includes: Agent
date: 2008-01-14
date: 2010-10-11
description: Examples of a Publisher include a person, an organization, or a service.
Relation: publisherT-001
Has Version: publisherT-001
issued: 2008-01-14
Date Modified: 2010-10-11

Yrs Undo
type: RunningProject
type: Proposal
type: Project
proposal name: Yrs Undo
proposal status: Running
proposal website: docs.yjs.dev
to fund: Assure Fund

StreetComplete
type: CompletedProject
type: Proposal
type: Project
proposal name: StreetComplete
proposal status: Complete
proposal website: StreetComplete
to fund: Discovery Fund

value
type: Property
comment: Idiomatic property used for structured values.
domain: Resource

Assure Fund
fund label: NGI Assure
fund status: Open
proposals accepted: 146
proposals submitted: 964

relationshipType variantOf
type: RelationshipType
type: Thing
type: NamedIndividual
comment: A Relationship of relationshipType_variantOf expresses that an SPDXElement is a variant of the relatedSPDXElement, but it is not clear which came first. For example, if the content of two Files differs by some edit, but there is no way to tell which came first (no reliable date information), then one File is a variant of the other File.
term status: stable

openEngiadina
type: CompletedProject
type: Proposal
type: Project
proposal name: openEngiadina
proposal status: Complete
proposal website: openengiadina.net
to fund: Discovery Fund

Port of AMDVLK/RADV 3D Driver to the Libre-SOC
type: Proposal
type: Project
proposal name: Port of AMDVLK/RADV 3D Driver to the Libre-SOC
proposal status: Selected
proposal website: nlnet 2019 amdvlk port
to fund: PET Fund

hasBody
type: Property
comment: The object of the relationship is a resource that is a body of the Annotation.
domain: Annotation

Ignore
type: Class
comment: Actor is ignoring the Object
subclass of: Activity

purpose container
type: Purpose
type: Thing
type: NamedIndividual
comment: The package refers to a container image which can be used by a container runtime application.
term status: stable

noassertion
type: Thing
type: NamedIndividual
comment: Individual to indicate the creator of the SPDX document does not assert any value for the object.

linking
type: Concept
type: Motivation
comment: The motivation for when the user intends to link to a resource related to the Target.

Dublin Core Metadata Element Set, Version 1.1
date: 2012-06-14
publisher: DCMI
Date Modified: 2012-06-14

Hardening OpenPGP CA deployments
type: RunningProject
type: Proposal
type: Project
proposal name: Hardening OpenPGP CA deployments
proposal status: Running
proposal website: openpgp-ca.org
to fund: Assure Fund

hadRole
type: Property
type: ObjectProperty
comment: The function of an entity or agent with respect to another entity or resource.
comment: Funkce entity či agenta ve vztahu k jiné entitě či zdroji. @cs
comment: Den funktion en entitet eller aktør har i forhold til en anden ressource. @da
comment: La funzione di un'entità o un agente rispetto ad un'altra entità o risorsa. @it
comment: La función de una entidad o agente con respecto a otra entidad o recurso. @es
domain: Class
  unionOf: Attribution
  unionOf: Relationship
label: haRuolo @it
label: havde rolle @da
label: sehraná role @cs
label: tiene rol @it
range: Role
change note: Nová vlastnost přidaná ve verzi DCAT 2.0. @cs
change note: Nuova proprietà aggiunta in DCAT 2.0. @it
change note: Nueva propiedad agregada en DCAT 2.0. @es
change note: New property added in DCAT 2.0.
editorial note: Agregada en DCAT para complementar prov:hadRole (cuyo uso está limitado a roles en el contexto de una actividad, con dominio prov:Association. @es
editorial note: Introdotta in DCAT per completare prov:hadRole (il cui uso è limitato ai ruoli nel contesto di un'attività, con il dominio di prov:Association. @it
editorial note: Introduced into DCAT to complement prov:hadRole (whose use is limited to roles in the context of an activity, with the domain of prov:Association.
editorial note: Introduceret i DCAT for at supplere prov:hadRole (hvis anvendelse er begrænset til roller i forbindelse med en aktivitet med domænet prov:Association). @da
editorial note: Přidáno do DCAT pro doplnění vlastnosti prov:hadRole (jejíž užití je omezeno na role v kontextu aktivity, s definičním oborem prov:Association). @cs
scope note: Puede usarse en una atribución cualificada para especificar el rol de una Entidad con respecto a otra Entidad. Se recomienda que su valor se tome de un vocabulario controlado de roles de entidades como por ejemplo: ISO 19115 DS_AssociationTypeCode http://registry.it.csiro.au/def/isotc211/DS_AssociationTypeCode; IANA Registry of Link Relations https://www.iana.org/assignments/link-relation; esquema de metadatos de DataCite; MARC relators https://id.loc.gov/vocabulary/relators. @es
scope note: Kan vendes ved kvalificerede krediteringer til at angive en aktørs rolle i forhold en entitet. Det anbefales at værdierne styres som et kontrolleret udfaldsrum med aktørroller, såsom http://registry.it.csiro.au/def/isotc211/CI_RoleCode. @da
scope note: Puede usarse en una atribución cualificada para especificar el rol de un Agente con respecto a una Entidad. Se recomienda que el valor sea de un vocabulario controlado de roles de agentes, como por ejemplo http://registry.it.csiro.au/def/isotc211/CI_RoleCode. @es
scope note: Può essere utilizzato in un'attribuzione qualificata per specificare il ruolo di un agente rispetto a un'entità. Si raccomanda che il valore sia preso da un vocabolario controllato di ruoli di agente, come ad esempio http://registry.it.csiro.au/def/isotc211/CI_RoleCode. @it
scope note: Může být použito v kvalifikovaném přiřazení pro specifikaci role Agenta ve vztahu k Entitě. Je doporučeno hodnotu vybrat z řízeného slovníku rolí agentů, jako například http://registry.it.csiro.au/def/isotc211/CI_RoleCode. @cs
scope note: May be used in a qualified-attribution to specify the role of an Agent with respect to an Entity. It is recommended that the value be taken from a controlled vocabulary of agent roles, such as http://registry.it.csiro.au/def/isotc211/CI_RoleCode.
scope note: May be used in a qualified-relation to specify the role of an Entity with respect to another Entity. It is recommended that the value be taken from a controlled vocabulary of entity roles such as: ISO 19115 DS_AssociationTypeCode http://registry.it.csiro.au/def/isotc211/DS_AssociationTypeCode; IANA Registry of Link Relations https://www.iana.org/assignments/link-relation; DataCite metadata schema; MARC relators https://id.loc.gov/vocabulary/relators.
scope note: Může být použito v kvalifikovaném vztahu pro specifikaci role Entity ve vztahu k jiné Entitě. Je doporučeno použít hodnotu z řízeného slovníku rolí entit, jako například ISO 19115 DS_AssociationTypeCode http://registry.it.csiro.au/def/isotc211/DS_AssociationTypeCode, IANA Registry of Link Relations https://www.iana.org/assignments/link-relation, DataCite metadata schema, MARC relators https://id.loc.gov/vocabulary/relators. @cs
scope note: Può essere utilizzata in una relazione qualificata per specificare il ruolo di un'entità rispetto a un'altra entità. Si raccomanda che il valore sia preso da un vocabolario controllato di ruoli di entità come ISO 19115 DS_AssociationTypeCode http://registry.it.csiro.au/def/isotc211/DS_AssociationTypeCode, IANA Registry of Link Relations https://www.iana.org/assignments/link-relation, DataCite metadata schema, o MARC relators https://id.loc.gov/vocabulary/relators. @it

CssSelector
type: Class
comment: A CssSelector describes a Segment of interest in a representation that conforms to the Document Object Model through the use of the CSS selector specification.
subclass of: Selector

SPARQL constraint component
type: Parameterizable
type: Constraint component
comment: A constraint component that can be used to define constraints based on SPARQL queries.
parameter: SPARQLConstraintComponent-sparql

fileType image
type: Thing
type: NamedIndividual
type: FileType
comment: The file is assoicated with an picture image file (MIME type of image/*, ie. .jpg, .gif ).
term status: stable

oqsprovider
type: CompletedProject
type: Proposal
type: Project
proposal name: oqsprovider
proposal status: Complete
proposal website: oqs-provider
to fund: Assure Fund

SPARQL ASK validator
type: Class
comment: The class of validators based on SPARQL ASK queries. The queries are evaluated for each value node and are supposed to return true if the given node conforms.
subclass of: Validator
subclass of: SPARQL ASK executable

prefix
type: Property
comment: The prefix of a prefix declaration.
domain: Prefix declaration

LTE support in OsmoCBC (Cell Broadcast Centre)
type: Project
type: CompletedProject
type: Proposal
proposal name: LTE support in OsmoCBC (Cell Broadcast Centre)
proposal status: Complete
proposal website: https://osmocom.org/issues/4945
proposal website: wiki
to fund: UOI Fund

Delta Tauri
type: RunningProject
type: Proposal
type: Project
proposal name: Delta Tauri
proposal status: Running
proposal website: deltachat-desktop
to fund: Entrust Fund

href
type: FunctionalProperty
type: Property
type: DatatypeProperty
comment: The target URI of the Link
domain: Link

Date
type: Property
comment: A point or period of time associated with an event in the lifecycle of the resource.
subPropertyOf: Date
date: 2008-01-14
description: Date may be used to express temporal information at any level of granularity. Recommended practice is to express the date, date/time, or period of time according to ISO 8601-1 [[ISO 8601-1](https://www.iso.org/iso-8601-date-and-time-format.html)] or a published profile of the ISO standard, such as the W3C Note on Date and Time Formats [[W3CDTF](https://www.w3.org/TR/NOTE-datetime)] or the Extended Date/Time Format Specification [[EDTF](http://www.loc.gov/standards/datetime/)]. If the full date is unknown, month and year (YYYY-MM) or just year (YYYY) may be used. Date ranges may be specified using ISO 8601 period of time specification in which start and end dates are separated by a '/' (slash) character. Either the start or end date may be missing.
description: Date may be used to express temporal information at any level of granularity. Recommended best practice is to use an encoding scheme, such as the W3CDTF profile of ISO 8601 [W3CDTF].
Relation: dateT-001
Has Version: dateT-001
issued: 2008-01-14
Date Modified: 2008-01-14

datatypeComplementOf
type: Property
comment: The property that determines that a given data range is the complement of another data range with respect to the data domain.
domain: Datatype
range: Datatype

Coverage
type: Property
comment: The spatial or temporal topic of the resource, spatial applicability of the resource, or jurisdiction under which the resource is relevant.
comment: The spatial or temporal topic of the resource, the spatial applicability of the resource, or the jurisdiction under which the resource is relevant.
range: Location, Period, or Jurisdiction
subPropertyOf: Coverage
range includes: Jurisdiction
range includes: DCMI Period
range includes: Location
date: 2008-01-14
description: Spatial topic and spatial applicability may be a named place or a location specified by its geographic coordinates. Temporal topic may be a named period, date, or date range. A jurisdiction may be a named administrative entity or a geographic place to which the resource applies. Recommended best practice is to use a controlled vocabulary such as the Thesaurus of Geographic Names [TGN]. Where appropriate, named places or time periods can be used in preference to numeric identifiers such as sets of coordinates or date ranges.
description: Spatial topic and spatial applicability may be a named place or a location specified by its geographic coordinates. Temporal topic may be a named period, date, or date range. A jurisdiction may be a named administrative entity or a geographic place to which the resource applies. Recommended practice is to use a controlled vocabulary such as the Getty Thesaurus of Geographic Names [[TGN](https://www.getty.edu/research/tools/vocabulary/tgn/index.html)]. Where appropriate, named places or time periods may be used in preference to numeric identifiers such as sets of coordinates or date ranges. Because coverage is so broadly defined, it is preferable to use the more specific subproperties Temporal Coverage and Spatial Coverage.
Relation: coverageT-001
Has Version: coverageT-001
issued: 2008-01-14
Date Modified: 2008-01-14

purpose application
type: Purpose
type: Thing
type: NamedIndividual
comment: The package is a software application.
term status: stable

ZSipOs
type: CompletedProject
type: Proposal
type: Project
proposal name: ZSipOs
proposal status: Complete
proposal website: www.vipcomag.de
to fund: PET Fund

purpose source
type: Purpose
type: Thing
type: NamedIndividual
comment: The package is a collection of source files.
term status: stable

hasExtractedLicensingInfo
type: Property
type: ObjectProperty
comment: Indicates that a particular ExtractedLicensingInfo was defined in the subject SpdxDocument.
domain: SpdxDocument
range: ExtractedLicensingInfo
term status: stable

Join
type: Class
comment: To Join Something
subclass of: Activity

Adding Web-of-Trust Support to PGPainless
type: CompletedProject
type: Proposal
type: Project
proposal name: Adding Web-of-Trust Support to PGPainless
proposal status: Complete
proposal website: pgpainless.org
to fund: Assure Fund

Verified Reowolf
type: RunningProject
type: Proposal
type: Project
proposal name: Verified Reowolf
proposal status: Running
proposal website: www.reowolf.net
to fund: Assure Fund

Validation result
type: Class
comment: The class of validation results.
subclass of: Abstract result

Mainstreaming Anonymity for Developers (MAD)
type: RunningProject
type: Proposal
type: Project
proposal name: Mainstreaming Anonymity for Developers (MAD)
proposal status: Running
proposal website: gosling
to fund: Entrust Fund

shares
type: Property
type: ObjectProperty
comment: The collection of Announce activities for an object
domain: Object
range: Class
  unionOf: OrderedAnnounceCollection
  unionOf: AnnounceCollection

WireGuard
type: CompletedProject
type: Proposal
type: Project
proposal name: WireGuard
proposal status: Complete
proposal website: www.wireguard.com
to fund: InternetHardeningFund

fileDependency
type: Property
type: ObjectProperty
comment: This field is deprecated since SPDX 2.0 in favor of using Section 7 which provides more granularity about relationships.
domain: File
range: File
deprecated: true
term status: deprecated

homepage
type: Property
type: ObjectProperty
comment: This axiom needed so that Protege loads DCAT2 without errors.

Title
type: Property
comment: A name given to the resource.
subPropertyOf: Title
date: 2008-01-14
date: 2010-10-11
Relation: titleT-002
Has Version: titleT-002
issued: 2008-01-14
Date Modified: 2010-10-11

ValOS Cryptographic Content Security project
type: CompletedProject
type: Proposal
type: Project
proposal name: ValOS Cryptographic Content Security project
proposal status: Complete
proposal website: valaa.com
to fund: PET Fund

to
type: Property
type: ObjectProperty
comment: Identifies an entity considered to be part of the public primary audience of an Object
domain: Object
range: Class
  unionOf: Object
  unionOf: Link

TOS;DR OTA backend
type: RunningProject
type: Proposal
type: Project
proposal name: TOS;DR OTA backend
proposal status: Running
proposal website: tosdr.org
proposal website: en
to fund: Entrust Fund

Ricochet Refresh
type: Proposal
type: Project
proposal name: Ricochet Refresh
proposal status: Selected
proposal website: ricochetrefresh.net
to fund: PET Fund

SPARQL executable
type: Class
comment: The class of resources that encapsulate a SPARQL query.
subclass of: Resource

Folksonomy engine for the food ecosystem
type: CompletedProject
type: Proposal
type: Project
proposal name: Folksonomy engine for the food ecosystem
proposal status: Complete
proposal website: discover
to fund: Discovery Fund

offset
type: Property
type: DatatypeProperty
domain: OffsetPointer
range: positiveInteger
term status: stable

OrderedItems
type: Class
comment: A rdf:List variant for Objects and Links
subclass of: Class
  intersectionOf: List
  intersectionOf: Class
    type: Restriction
    allValuesFrom: Class
      unionOf: Object
      unionOf: Link
    onProperty: first
  intersectionOf: Class
    type: Restriction
    allValuesFrom: OrderedItems
    onProperty: rest

updated
type: FunctionalProperty
type: Property
type: DatatypeProperty
comment: Specifies when the object was last updated
domain: Object
range: dateTime

hasState
type: Property
comment: The relationship between the ResourceSelection, or its subclass SpecificResource, and a State resource. Please note that the domain ( oa:ResourceSelection ) is not used directly in the Web Annotation model.
domain: ResourceSelection
range: State

KDE Connect
type: RunningProject
type: Proposal
type: Project
proposal name: KDE Connect
proposal status: Running
proposal website: kdeconnect-kde
to fund: Assure Fund

Pixelfed
type: CompletedProject
type: Proposal
type: Project
proposal name: Pixelfed
proposal status: Complete
proposal website: pixelfed.org
to fund: Discovery Fund

propertyDisjointWith
type: Property
comment: The property that determines that two given properties are disjoint.
domain: Property
range: Property

SvgSelector
type: Class
comment: An SvgSelector defines an area through the use of the Scalable Vector Graphics [SVG] standard. This allows the user to select a non-rectangular area of the content, such as a circle or polygon by describing the region using SVG. The SVG may be either embedded within the Annotation or referenced as an External Resource.
subclass of: Selector

JellyfishOPP
type: RunningProject
type: Proposal
type: Project
proposal name: JellyfishOPP
proposal status: Running
proposal website: jellyfishopp
to fund: Entrust Fund

range
type: Property
comment: A range of the subject property.
domain: Property
range: Class

min count
type: Property
comment: Specifies the minimum number of values in the set of value nodes.

OpenPGP Certificate Authority
type: CompletedProject
type: Proposal
type: Project
proposal name: OpenPGP Certificate Authority
proposal status: Complete
proposal website: openpgp-ca
to fund: PET Fund

conforms
type: Property
comment: True if the validation did not produce any validation results, and false otherwise.
domain: Validation report

annotationType other
type: AnnotationType
type: Thing
type: NamedIndividual
comment: Type of annotation which does not fit in any of the pre-defined annotation types.
term status: stable

DataPositionSelector
type: Class
comment: DataPositionSelector describes a range of data by recording the start and end positions of the selection in the stream. Position 0 would be immediately before the first byte, position 1 would be immediately before the second byte, and so on. The start byte is thus included in the list, but the end byte is not.
subclass of: Selector

result path
type: Property
comment: The path of a validation result, based on the path of the validated property shape.
domain: Abstract result

licenseInfoInSnippet
type: Property
type: ObjectProperty
comment: Licensing information that was discovered directly in the subject snippet. This is also considered a declared license for the snippet. If the licenseInfoInSnippet field is not present for a snippet, it implies an equivalent meaning to NOASSERTION.
domain: Snippet
range: Class
  unionOf: AnyLicenseInfo
  unionOf: Class
    type: Restriction
    hasValue: noassertion
    onProperty: licenseInfoInFile
  unionOf: Class
    type: Restriction
    hasValue: none
    onProperty: licenseInfoInFile
subPropertyOf: licenseInfoFromFiles
term status: stable

qualified relation
type: Property
type: ObjectProperty
comment: Reference til en beskrivelse af en relation til en anden ressource. @da
comment: Enlace a una descripción de la relación con otro recurso. @es
comment: Link to a description of a relationship with another resource.
comment: Link a una descrizione di una relazione con un'altra risorsa. @it
comment: Odkaz na popis vztahu s jiným zdrojem. @cs
domain: Catalogued resource
label: kvalifikovaný vztah @cs
label: relación calificada @es
label: Kvalificeret relation @da
label: relazione qualificata @it
range: Relationship
change note: Propiedad nueva añadida en DCAT 2.0. @es
change note: Nuova proprietà aggiunta in DCAT 2.0. @it
change note: Ny egenskab tilføjet i DCAT 2.0. @da
change note: New property added in DCAT 2.0.
change note: Nová vlastnost přidaná ve verzi DCAT 2.0. @cs
editorial note: Introduceret i DCAT med henblik på at supplere de øvrige kvalificerede relationer fra PROV. @da
editorial note: Introdotta in DCAT per integrare le altre relazioni qualificate di PROV. @it
editorial note: Se incluyó en DCAT para complementar las relaciones calificadas disponibles en PROV. @es
editorial note: Přidáno do DCAT k doplnění jiných kvalifikovaných vztahů ze slovníku PROV. @cs
editorial note: Introduced into DCAT to complement the other PROV qualified relations.
scope note: Se usa para asociar con otro recurso para el cuál la naturaleza de la relación es conocida pero no es ninguna de las propiedades que provee el estándar Dublin Core (dct:hasPart, dct:isPartOf, dct:conformsTo, dct:isFormatOf, dct:hasFormat, dct:isVersionOf, dct:hasVersion, dct:replaces, dct:isReplacedBy, dct:references, dct:isReferencedBy, dct:requires, dct:isRequiredBy) or PROV-O properties (prov:wasDerivedFrom, prov:wasInfluencedBy, prov:wasQuotedFrom, prov:wasRevisionOf, prov:hadPrimarySource, prov:alternateOf, prov:specializationOf). @es
scope note: Použito pro odkazování na jiný zdroj, kde druh vztahu je znám, ale neodpovídá standardním vlastnostem ze slovníku Dublin Core (dct:hasPart, dct:isPartOf, dct:conformsTo, dct:isFormatOf, dct:hasFormat, dct:isVersionOf, dct:hasVersion, dct:replaces, dct:isReplacedBy, dct:references, dct:isReferencedBy, dct:requires, dct:isRequiredBy) či slovníku PROV-O (prov:wasDerivedFrom, prov:wasInfluencedBy, prov:wasQuotedFrom, prov:wasRevisionOf, prov:hadPrimarySource, prov:alternateOf, prov:specializationOf). @cs
scope note: Viene utilizzato per associarsi a un'altra risorsa nei casi per i quali la natura della relazione è nota ma non è alcuna delle proprietà fornite dallo standard Dublin Core (dct:hasPart, dct:isPartOf, dct:conformsTo, dct:isFormatOf, dct:hasFormat , dct:isVersionOf, dct:hasVersion, dct:replaces, dct:isReplacedBy, dct:references, dct:isReferencedBy, dct:require, dct:isRequiredBy) o dalle proprietà fornite da PROV-O (prov:wasDerivedFrom, prov:wasInfluencedBy, prov:wasQuotedFrom , prov:wasRevisionOf, prov:hadPrimarySource, prov:alternateOf, prov:specializationOf). @it
scope note: Anvendes til at referere til en anden ressource hvor relationens betydning er kendt men ikke matcher en af de standardiserede egenskaber fra Dublin Core (dct:hasPart, dct:isPartOf, dct:conformsTo, dct:isFormatOf, dct:hasFormat, dct:isVersionOf, dct:hasVersion, dct:replaces, dct:isReplacedBy, dct:references, dct:isReferencedBy, dct:requires, dct:isRequiredBy) eller PROV-O-egenskaber (prov:wasDerivedFrom, prov:wasInfluencedBy, prov:wasQuotedFrom, prov:wasRevisionOf, prov:hadPrimarySource, prov:alternateOf, prov:specializationOf). @da
scope note: Used to link to another resource where the nature of the relationship is known but does not match one of the standard Dublin Core properties (dct:hasPart, dct:isPartOf, dct:conformsTo, dct:isFormatOf, dct:hasFormat, dct:isVersionOf, dct:hasVersion, dct:replaces, dct:isReplacedBy, dct:references, dct:isReferencedBy, dct:requires, dct:isRequiredBy) or PROV-O properties (prov:wasDerivedFrom, prov:wasInfluencedBy, prov:wasQuotedFrom, prov:wasRevisionOf, prov:hadPrimarySource, prov:alternateOf, prov:specializationOf).

Wireguard
type: CompletedProject
type: Proposal
type: Project
proposal name: Wireguard
proposal status: Complete
proposal website: wireguard.com
to fund: PET Fund

The data catalog vocabulary
type: Ontology
comment: DCAT è un vocabolario RDF progettato per facilitare l'interoperabilità tra i cataloghi di dati pubblicati nel Web. Utilizzando DCAT per descrivere i dataset nei cataloghi di dati, i fornitori migliorano la capacità di individuazione dei dati e abilitano le applicazioni al consumo di dati provenienti da cataloghi differenti. DCAT permette di decentralizzare la pubblicazione di cataloghi e facilita la ricerca federata dei dataset. L'aggregazione dei metadati federati può fungere da file manifesto per facilitare la conservazione digitale. DCAT è definito all'indirizzo http://www.w3.org/TR/vocab-dcat/. Qualsiasi scostamento tra tale definizione normativa e questo schema è da considerarsi un errore di questo schema. @it
comment: Το DCAT είναι ένα RDF λεξιλόγιο που σχεδιάσθηκε για να κάνει εφικτή τη διαλειτουργικότητα μεταξύ καταλόγων δεδομένων στον Παγκόσμιο Ιστό. Χρησιμοποιώντας το DCAT για την περιγραφή συνόλων δεδομένων, οι εκδότες αυτών αυξάνουν την ανακαλυψιμότητα και επιτρέπουν στις εφαρμογές την εύκολη κατανάλωση μεταδεδομένων από πολλαπλούς καταλόγους. Επιπλέον, δίνει τη δυνατότητα για αποκεντρωμένη έκδοση και διάθεση καταλόγων και επιτρέπει δυνατότητες ενοποιημένης αναζήτησης μεταξύ διαφορετικών πηγών. Συγκεντρωτικά μεταδεδομένα που έχουν περιγραφεί με το DCAT μπορούν να χρησιμοποιηθούν σαν ένα δηλωτικό αρχείο (manifest file) ώστε να διευκολύνουν την ψηφιακή συντήρηση. @el
comment: DCAT es un vocabulario RDF diseñado para facilitar la interoperabilidad entre catálogos de datos publicados en la Web. Utilizando DCAT para describir datos disponibles en catálogos se aumenta la posibilidad de que sean descubiertos y se permite que las aplicaciones consuman fácilmente los metadatos de varios catálogos. @es
comment: DCAT is an RDF vocabulary designed to facilitate interoperability between data catalogs published on the Web. By using DCAT to describe datasets in data catalogs, publishers increase discoverability and enable applications easily to consume metadata from multiple catalogs. It further enables decentralized publishing of catalogs and facilitates federated dataset search across sites. Aggregated DCAT metadata can serve as a manifest file to facilitate digital preservation. DCAT is defined at http://www.w3.org/TR/vocab-dcat/. Any variance between that normative document and this schema is an error in this schema.
comment: DCATは、ウェブ上で公開されたデータ・カタログ間の相互運用性の促進を目的とするRDFの語彙です。このドキュメントでは、その利用のために、スキーマを定義し、例を提供します。データ・カタログ内のデータセットを記述するためにDCATを用いると、公開者が、発見可能性を増加させ、アプリケーションが複数のカタログのメタデータを容易に利用できるようになります。さらに、カタログの分散公開を可能にし、複数のサイトにまたがるデータセットの統合検索を促進します。集約されたDCATメタデータは、ディジタル保存を促進するためのマニフェスト・ファイルとして使用できます。 @ja
comment: هي أنطولوجية تسهل تبادل البيانات بين مختلف الفهارس على الوب. استخدام هذه الأنطولوجية يساعد على اكتشاف قوائم البيانات المنشورة على الوب و يمكن التطبيقات المختلفة من الاستفادة أتوماتيكيا من البيانات المتاحة من مختلف الفهارس. @ar
comment: DCAT je RDF slovník navržený pro zprostředkování interoperability mezi datovými katalogy publikovanými na Webu. Poskytovatelé dat používáním slovníku DCAT pro popis datových sad v datových katalozích zvyšují jejich dohledatelnost a umožňují aplikacím konzumovat metadata z více katalogů. Dále je umožňena decentralizovaná publikace katalogů a federované dotazování na datové sady napříč katalogy. Agregovaná DCAT metadata mohou také sloužit jako průvodka umožňující digitální uchování informace. DCAT je definován na http://www.w3.org/TR/vocab-dcat/. Jakýkoliv nesoulad mezi odkazovaným dokumentem a tímto schématem je chybou v tomto schématu. @cs
comment: DCAT est un vocabulaire développé pour faciliter l'interopérabilité entre les jeux de données publiées sur le Web. En utilisant DCAT pour décrire les jeux de données dans les catalogues de données, les fournisseurs de données augmentent leur découverte et permettent que les applications facilement les métadonnées de plusieurs catalogues. Il permet en plus la publication décentralisée des catalogues et facilitent la recherche fédérée des données entre plusieurs sites. Les métadonnées DCAT aggrégées peuvent servir comme un manifeste pour faciliter la préservation digitale des ressources. DCAT est définie à l'adresse http://www.w3.org/TR/vocab-dcat/. Une quelconque version de ce document normatif et ce vocabulaire est une erreur dans ce vocabulaire. @fr
comment: DCAT er et RDF-vokabular som har til formål at understøtte interoperabilitet mellem datakataloger udgivet på nettet. Ved at anvende DCAT til at beskrive datasæt i datakataloger, kan udgivere øge findbarhed og gøre det gøre det lettere for applikationer at anvende metadata fra forskellige kataloger. Derudover understøttes decentraliseret udstilling af kataloger og fødererede datasætsøgninger på tværs af websider. Aggregerede DCAT-metadata kan fungere som fortegnelsesfiler der kan understøtte digital bevaring. DCAT er defineret på http://www.w3.org/TR/vocab-dcat/. Enhver forskel mellem det normative dokument og dette schema er en fejl i dette schema. @da
label: データ・カタログ語彙（DCAT） @ja
label: Το λεξιλόγιο των καταλόγων δεδομένων @el
label: أنطولوجية فهارس قوائم البيانات @ar
label: Datakatalogvokabular @da
label: El vocabulario de catálogo de datos @es
label: Le vocabulaire des jeux de données @fr
label: Il vocabolario del catalogo dei dati @it
label: Slovník pro datové katalogy @cs
Contributor: Riccardo Albertoni
Contributor: Richard Cyganiak
Contributor: Vassilios Peristeras
Contributor: Phil Archer
Contributor: Boris Villazón-Terrazas
Contributor: Fadi Maali
Contributor: Alejandra Gonzalez-Beltran
Contributor: Makx Dekkers
Contributor: Jakub Klímek
Contributor: Shuji Kamitsuna
Contributor: David Browning
Contributor: John Erickson
Contributor: Martin Alvarez-Espinar
Contributor: Rufus Pollock
Contributor: Andrea Perego
Contributor: Simon J D Cox
Contributor: Marios Meimaris
Contributor: Ghislain Auguste Atemezing
creator: Fadi Maali
creator: John Erickson
date: 2012-04-24
date: 2017-12-19
date: 2019
date: 2020-11-30
date: 2013-09-20
date: 2013-11-28
date: 2021-09-14
Rights: https://creativecommons.org/licenses/by/4.0/
License: https://creativecommons.org/licenses/by/4.0/
Date Modified: 2017-12-19
Date Modified: 2013-11-28
Date Modified: 2021-09-14
Date Modified: 2012-04-24
Date Modified: 2019
Date Modified: 2020-11-30
Date Modified: 2013-09-20
imports: DCMI Metadata Terms - other
imports: prov-o#
imports: core
versionInfo: Toto je aktualizovaná kopie slovníku DCAT verze 2.0, převzatá z https://www.w3.org/ns/dcat.ttl @cs
versionInfo: Dette er en opdateret kopi af DCAT v. 2.0 som er tilgænglig på https://www.w3.org/ns/dcat.ttl @da
versionInfo: Esta es una copia del vocabulario DCAT v2.0 disponible en https://www.w3.org/ns/dcat.ttl @es
versionInfo: This is an updated copy of v2.0 of the DCAT vocabulary, taken from https://www.w3.org/ns/dcat.ttl
versionInfo: Questa è una copia aggiornata del vocabolario DCAT v2.0 disponibile in https://www.w3.org/ns/dcat.ttl
editorial note: English language definitions updated in this revision in line with ED. Multilingual text unevenly updated.
maker: Government Linked Data WG

relationshipType buildDependencyOf
type: RelationshipType
type: Thing
type: NamedIndividual
comment: Is to be used when SPDXRef-A is a build dependency of SPDXRef-B.
term status: stable

contact point
type: ObjectProperty
type: Property
comment: Relevantní kontaktní informace pro katalogizovaný zdroj. Doporučuje se použít slovník VCard. @cs
comment: Συνδέει ένα σύνολο δεδομένων με ένα σχετικό σημείο επικοινωνίας, μέσω VCard. @el
comment: تربط قائمة البيانات بعنوان اتصال موصف باستخدام VCard @ar
comment: データセットを、VCardを用いて提供されている適切な連絡先情報にリンクします。 @ja
comment: Informazioni di contatto rilevanti per la risorsa catalogata. Si raccomanda l'uso di vCard. @it
comment: Información relevante de contacto para el recurso catalogado. Se recomienda el uso de vCard. @es
comment: Relie un jeu de données à une information de contact utile en utilisant VCard. @fr
comment: Relevant contact information for the catalogued resource. Use of vCard is recommended.
comment: Relevante kontaktoplysninger for den katalogiserede ressource. Anvendelse af vCard anbefales. @da
label: kontaktpunkt @da
label: Punto de contacto @es
label: punto di contatto @it
label: kontaktní bod @cs
label: σημείο επικοινωνίας @el
label: 窓口 @ja
label: عنوان اتصال @ar
label: point de contact @fr
range: Kind
editorial note: Status: English Definition text modified by DCAT revision team, Italian, Spanish and Czech translations provided, other translations pending.

Misskey
type: Proposal
type: Project
proposal name: Misskey
proposal status: Selected
proposal website: misskey
to fund: Discovery Fund

Improvements for the next generation firewalling tool in Linux
type: Proposal
type: Project
proposal name: Improvements for the next generation firewalling tool in Linux
proposal status: Selected
proposal website: www.netfilter.org
to fund: Entrust Fund

Py2HWSW
type: Proposal
type: Project
proposal name: Py2HWSW
proposal status: Selected
proposal website: py2hwsw
to fund: Core Fund

Naja
type: Proposal
type: Project
proposal name: Naja
proposal status: Selected
proposal website: naja
to fund: Entrust Fund

FileSender
fund label: FileSender
fund status: Open
proposals accepted: 13
proposals submitted: 13

The search for ethical Apps
type: CompletedProject
type: Proposal
type: Project
proposal name: The search for ethical Apps
proposal status: Complete
proposal website: guardianproject.info
to fund: Discovery Fund

PlainLiteral
type: Class
type: Datatype
comment: The class of plain (i.e. untyped) literal values, as used in RIF and OWL 2
subclass of: Literal

NLM
type: VocabularyEncodingScheme
comment: The set of conceptual resources specified by the National Library of Medicine Classification.
date: 2005-06-13
date: 2008-01-14
Relation: NLM-002
Has Version: NLM-002
issued: 2005-06-13
Date Modified: 2008-01-14

licenseTextHtml
type: Property
type: DatatypeProperty
comment: License text in HTML format
domain: ListedLicense
term status: stable

video box
type: CompletedProject
type: Proposal
type: Project
proposal name: video box
proposal status: Complete
proposal website: fosdem.org
to fund: PET Fund

supplier
type: DatatypeProperty
type: Property
comment: The name and, optionally, contact information of the person or organization who was the immediate supplier of this package to the recipient. The supplier may be different than originator when the software has been repackaged. Values of this property must conform to the agent and tool syntax.
domain: Package
term status: stable

Let's Connect! Client-Server to P2P
type: Proposal
type: Project
proposal name: Let's Connect! Client-Server to P2P
proposal status: Selected
proposal website: www.letsconnect-vpn.org
to fund: Assure Fund

rtlDirection
type: Direction
comment: The direction of text that is read from right to left.

post
type: Property
type: ObjectProperty
comment: カタログの一部であるカタログ・レコード。 @ja
comment: A record describing the registration of a single dataset or data service that is part of the catalog.
comment: En post der beskriver registreringen af et enkelt datasæt eller en datatjeneste som er opført i kataloget. @da
comment: تربط الفهرس بسجل ضمنه @ar
comment: Záznam popisující registraci jedné datové sady či datové služby jakožto součásti katalogu. @cs
comment: Describe la registración de un conjunto de datos o un servicio de datos en el catálogo. @es
comment: Propojuje katalog a jeho záznamy. @cs
comment: Relie un catalogue à ses registres. @fr
comment: Un record che descrive la registrazione di un singolo set di dati o di un servizio dati che fa parte del catalogo. @it
comment: Συνδέει έναν κατάλογο με τις καταγραφές του. @el
domain: Catalog
label: καταγραφή @el
label: registro @es
label: record
label: záznam @cs
label: registre @fr
label: سجل @ar
label: カタログ・レコード @ja
range: Catalog Record
alternative label: har post @da
editorial note: Status: English, Italian, Spanish and Czech Definitions modified by DCAT revision team, other translations pending.

proxyUrl
type: FunctionalProperty
type: Property
type: ObjectProperty
comment: Endpoint URI so this actor's clients may access remote ActivityStreams objects which require authentication to access. To use this endpoint, the client posts an x-www-form-urlencoded id parameter with the value being the id of the requested ActivityStreams object.
domain: Actor

Nothing
type: Class
comment: This is the empty class.
subclass of: Thing

Ghislain Auguste Atemezing
type: Agent

sourceDateEnd
type: Property
comment: The end timestamp of the interval over which the Source resource should be interpreted as being applicable to the Annotation.
domain: TimeState
range: dateTime

Offen
type: CompletedProject
type: Proposal
type: Project
proposal name: Offen
proposal status: Complete
proposal website: www.offen.dev
to fund: Discovery Fund

libspng
type: Proposal
type: Project
proposal name: libspng
proposal status: Selected
proposal website: libspng.org
to fund: PET Fund

Suhosin-NG
type: CompletedProject
type: Proposal
type: Project
proposal name: Suhosin-NG
proposal status: Complete
proposal website: suhosin.org
to fund: PET Fund

XWiki
type: CompletedProject
type: Proposal
type: Project
proposal name: XWiki
proposal status: Complete
proposal website: www.xwiki.org
to fund: Discovery Fund

CrossRef
type: Class
comment: Cross reference details for the a URL reference
subclass of: Class
  type: Restriction
  maxQualifiedCardinality: 1
  onDataRange: boolean
  onProperty: isValid
subclass of: Class
  type: Restriction
  onDataRange: anyURI
  onProperty: url
  qualifiedCardinality: 1
subclass of: Class
  type: Restriction
  maxQualifiedCardinality: 1
  onDataRange: nonNegativeInteger
  onProperty: order
subclass of: Class
  type: Restriction
  maxQualifiedCardinality: 1
  onDataRange: string
  onProperty: match
subclass of: Class
  type: Restriction
  maxQualifiedCardinality: 1
  onDataRange: anyURI
  onProperty: isWayBackLink
subclass of: Class
  type: Restriction
  maxQualifiedCardinality: 1
  onDataRange: dateTime
  onProperty: timestamp
subclass of: Class
  type: Restriction
  maxQualifiedCardinality: 1
  onDataRange: boolean
  onProperty: isLive
term status: stable

WireGuard
type: CompletedProject
type: Proposal
type: Project
proposal name: WireGuard
proposal status: Complete
proposal website: www.wireguard.com
to fund: PET Fund

Oku
type: Proposal
type: Project
proposal name: Oku
proposal status: Selected
proposal website: oku
to fund: Entrust Fund

SoC Fund
fund label: System-on-a-Chip Fund
fund status: Open
proposals accepted: 1
proposals submitted: 1

Event
type: Class
comment: An Event of any kind
subclass of: Object

Improve Email Encryption in KMail
type: Proposal
type: Project
proposal name: Improve Email Encryption in KMail
proposal status: Selected
proposal website: kmail.html
to fund: PET Fund

p4-nix
type: Project
type: Proposal
type: RunningProject
proposal name: p4-nix
proposal status: Running
proposal website: p4
proposal website: nixos.org
to fund: Assure Fund

EDeA
type: CompletedProject
type: Proposal
type: Project
proposal name: EDeA
proposal status: Complete
proposal website: hub.automated.ee
to fund: Discovery Fund

Liberaforms
type: CompletedProject
type: Proposal
type: Project
proposal name: Liberaforms
proposal status: Complete
proposal website: liberaforms.org
to fund: PET Fund

Tracking the Trackers
type: CompletedProject
type: Proposal
type: Project
proposal name: Tracking the Trackers
proposal status: Complete
proposal website: new-collaborations-on-exposing-tracking.html
to fund: PET Fund

qualifiedCardinality
type: Property
type: AnnotationProperty
comment: The property that determines the cardinality of an exact qualified cardinality restriction.
domain: Restriction

libresilient
type: RunningProject
type: Proposal
type: Project
proposal name: libresilient
proposal status: Running
proposal website: libresilient
to fund: Assure Fund

nil
type: OrderedItems
comment: The empty list, with no items in it. If the rest of a list is nil then the list has no more items in it.

Space Tube
type: RunningProject
type: Proposal
type: Project
proposal name: Space Tube
proposal status: Running
proposal website: introduction-to-space-tube.html
to fund: Entrust Fund

KiCad
type: RunningProject
type: Proposal
type: Project
proposal name: KiCad
proposal status: Running
proposal website: www.kicad.org
to fund: UOI Fund

select
type: Property
comment: The SPARQL SELECT query to execute.
domain: SPARQL SELECT executable

smoltcp RPL
type: RunningProject
type: Proposal
type: Project
proposal name: smoltcp RPL
proposal status: Running
proposal website: smoltcp
to fund: Assure Fund

isOsiApproved
type: Property
type: DatatypeProperty
comment: Indicates if the OSI has approved the license.
domain: License
term status: stable

eduVPN Linux client 2.1/2.2
type: CompletedProject
type: Proposal
type: Project
proposal name: eduVPN Linux client 2.1/2.2
proposal status: Complete
proposal website: www.eduvpn.org
to fund: VPN Fund

CryptPad: Project Dialogue
type: CompletedProject
type: Proposal
type: Project
proposal name: CryptPad: Project Dialogue
proposal status: Complete
proposal website: cryptpad.fr
to fund: PET Fund

lemmur
type: CompletedProject
type: Proposal
type: Project
proposal name: lemmur
proposal status: Complete
proposal website: lemmur
to fund: Discovery Fund

withRestrictions
type: Property
comment: The property that determines the collection of facet-value pairs that define a datatype restriction.
domain: Datatype
range: List

closed
type: FunctionalProperty
type: Property
type: DatatypeProperty
comment: Indicates that a question has been closed, and answers are no longer accepted.
domain: Object
range: dateTime

Class
comment: The class of OWL classes.
subclass of: Class

AnyLicenseInfo
type: Class
comment: The AnyLicenseInfo class includes all resources that represent licensing information.
term status: stable

uFork/FPGA
type: Proposal
type: Project
proposal name: uFork/FPGA
proposal status: Selected
proposal website: uFork
to fund: Entrust Fund

ipfs-search.com
type: CompletedProject
type: Proposal
type: Project
proposal name: ipfs-search.com
proposal status: Complete
proposal website: ipfs-search.com
to fund: Discovery Fund

example
type: DatatypeProperty
type: Property
comment: Text for examples in describing an SPDX element.
domain: LicenseException
term status: stable

WPE Android
type: RunningProject
type: Proposal
type: Project
proposal name: WPE Android
proposal status: Running
proposal website: wpewebkit.org
to fund: Core Fund

relationshipType amendment
type: RelationshipType
type: Thing
type: NamedIndividual
comment: To be used when SPDXRef-A amends the SPDX information in SPDXRef-B.
term status: stable

NextGraph
type: RunningProject
type: Proposal
type: Project
proposal name: NextGraph
proposal status: Running
proposal website: nextgraph.org
to fund: Assure Fund

licenseDeclared
type: ObjectProperty
type: Property
comment: The licensing that the creators of the software in the package, or the packager, have declared. Declarations by the original software creator should be preferred, if they exist.
domain: SpdxItem
range: AnyLicenseInfo
term status: stable

Conforms To
type: Property
comment: An established standard to which the described resource conforms.
range: Standard
subPropertyOf: Relation
range includes: Standard
date: 2008-01-14
date: 2001-05-21
Relation: conformsTo-003
Has Version: conformsTo-003
issued: 2001-05-21
Date Modified: 2008-01-14

Apicula IO primitives
type: Proposal
type: Project
proposal name: Apicula IO primitives
proposal status: Selected
proposal website: apicula
to fund: Entrust Fund

Manyverse
type: CompletedProject
type: Proposal
type: Project
proposal name: Manyverse
proposal status: Complete
proposal website: www.manyver.se
to fund: PET Fund

OnBaSca
type: CompletedProject
type: Proposal
type: Project
proposal name: OnBaSca
proposal status: Complete
proposal website: onbasca.readthedocs.io
to fund: PET Fund

Katzen
type: CompletedProject
type: Proposal
type: Project
proposal name: Katzen
proposal status: Complete
proposal website: katzenpost.mixnetworks.org
to fund: Assure Fund

Namecoin
type: CompletedProject
type: Proposal
type: Project
proposal name: Namecoin
proposal status: Complete
proposal website: namecoin.org
to fund: InternetHardeningFund

Encoding for Robust Immutable Storage (ERIS)
type: RunningProject
type: Proposal
type: Project
proposal name: Encoding for Robust Immutable Storage (ERIS)
proposal status: Running
proposal website: eris
to fund: Assure Fund

TerosHDL: OSS, GHDL, NVC
type: RunningProject
type: Proposal
type: Project
proposal name: TerosHDL: OSS, GHDL, NVC
proposal status: Running
proposal website: intro
to fund: Entrust Fund

relationshipType testToolOf
type: RelationshipType
type: Thing
type: NamedIndividual
comment: Is to be used when SPDXRef-A is used as a test tool for SPDXRef-B.
term status: stable

Let's Connect VPN provisioning
type: CompletedProject
type: Proposal
type: Project
proposal name: Let's Connect VPN provisioning
proposal status: Complete
proposal website: eduvpn.org
to fund: VPN Fund

result message
type: Property
comment: Human-readable messages explaining the cause of the result.
domain: Abstract result

postmarketOS
type: CompletedProject
type: Proposal
type: Project
proposal name: postmarketOS
proposal status: Complete
proposal website: postmarketos.org
to fund: PET Fund

Coverage
type: Property
comment: The spatial or temporal topic of the resource, spatial applicability of the resource, or jurisdiction under which the resource is relevant.
date: 1999-07-02
description: Spatial topic and spatial applicability may be a named place or a location specified by its geographic coordinates. Temporal topic may be a named period, date, or date range. A jurisdiction may be a named administrative entity or a geographic place to which the resource applies. Recommended practice is to use a controlled vocabulary such as the Getty Thesaurus of Geographic Names [[TGN](https://www.getty.edu/research/tools/vocabulary/tgn/index.html)]. Where appropriate, named places or time periods may be used in preference to numeric identifiers such as sets of coordinates or date ranges.
issued: 1999-07-02
note: A [second property](/specifications/dublin-core/dcmi-terms/#http://purl.org/dc/terms/coverage) with the same name as this property has been declared in the [dcterms: namespace](http://purl.org/dc/terms/). See the Introduction to the document [DCMI Metadata Terms](/specifications/dublin-core/dcmi-terms/) for an explanation.

UberDDR3
type: Proposal
type: Project
proposal name: UberDDR3
proposal status: Selected
proposal website: DDR3 Controller
to fund: Entrust Fund

Letswifi/Geteduroam
type: RunningProject
type: Proposal
type: Project
proposal name: Letswifi/Geteduroam
proposal status: Running
proposal website: www.geteduroam.app
to fund: GetEduroam Fund

checksumValue
type: FunctionalProperty
type: Property
type: DatatypeProperty
comment: The checksumValue property provides a lower case hexidecimal encoded digest value produced using a specific algorithm.
domain: Checksum
range: hexBinary
term status: stable

Namecoin: Core Infrastructure
type: CompletedProject
type: Proposal
type: Project
proposal name: Namecoin: Core Infrastructure
proposal status: Complete
proposal website: www.namecoin.org
to fund: Discovery Fund

prefixes
type: Property
comment: The prefixes that shall be applied before parsing the associated SPARQL query.
domain: SPARQL executable
range: Ontology

AnnotationType
type: Class
comment: This type describes the type of annotation. Annotations are usually created when someone reviews the file, and if this is the case the annotation type should be REVIEW.
term status: stable

Function
type: Class
comment: The class of SHACL functions.
subclass of: Parameterizable

AllDifferent
type: Class
comment: The class of collections of pairwise different individuals.
subclass of: Resource

topDataProperty
type: Property
type: DatatypeProperty
comment: The data property that relates every individual to every data value.
domain: Thing

EteSync - iOS application
type: CompletedProject
type: Proposal
type: Project
proposal name: EteSync - iOS application
proposal status: Complete
proposal website: www.etesync.com
to fund: PET Fund

License Document
type: Class
comment: A legal document giving official permission to do something with a resource.
comment: A legal document giving official permission to do something with a Resource.
subclass of: Rights Statement
date: 2008-01-14
Relation: LicenseDocument-001
Has Version: LicenseDocument-001
issued: 2008-01-14

LCC
type: VocabularyEncodingScheme
comment: The set of conceptual resources specified by the Library of Congress Classification.
date: 2000-07-11
date: 2008-01-14
Relation: LCC-003
Has Version: LCC-003
issued: 2000-07-11
Date Modified: 2008-01-14

referenceCategory security
type: ReferenceCategory
type: Thing
type: NamedIndividual
term status: stable

hasScope
type: Property
comment: The scope or context in which the resource is used within the Annotation.
domain: SpecificResource

Open source ePDG for VoWiFi
type: RunningProject
type: Proposal
type: Project
proposal name: Open source ePDG for VoWiFi
proposal status: Running
proposal website: osmocom.org
to fund: UOI Fund

Not constraint component
type: Parameterizable
type: Constraint component
comment: A constraint component that can be used to verify that value nodes do not conform to a given shape.
parameter: NotConstraintComponent-not

relationshipType patchApplied
type: RelationshipType
type: Thing
type: NamedIndividual
comment: A Relationship of relationshipType_patchApplied expresses that the SPDXElement is a 'patchfile' that was applied and produced the relatedSPDXElement. For example, a .diff File relates to a specific file where the diff was applied.
term status: stable

Improving OpenSSH's Authentication and PKI
type: RunningProject
type: Proposal
type: Project
proposal name: Improving OpenSSH's Authentication and PKI
proposal status: Running
proposal website: sequoia-pgp.org
to fund: Assure Fund

Checksum
type: Class
comment: A Checksum is value that allows the contents of a file to be authenticated. Even small changes to the content of the file will change its checksum. This class allows the results of a variety of checksum and cryptographic message digest algorithms to be represented.
subclass of: Class
  type: Restriction
  onDataRange: hexBinary
  onProperty: checksumValue
  qualifiedCardinality: 1
subclass of: Class
  type: Restriction
  onClass: ChecksumAlgorithm
  onProperty: algorithm
  qualifiedCardinality: 1
term status: stable

Libre Car Control
type: RunningProject
type: Proposal
type: Project
proposal name: Libre Car Control
proposal status: Running
proposal website: proposal
to fund: Entrust Fund

Armbian
type: Proposal
type: Project
proposal name: Armbian
proposal status: Selected
proposal website: www.armbian.com
to fund: UOI Fund

Max-exclusive constraint component
type: Parameterizable
type: Constraint component
comment: A constraint component that can be used to restrict the range of value nodes with a maximum exclusive value.
parameter: MaxExclusiveConstraintComponent-maxExclusive

Rights Holder
type: Property
comment: A person or organization owning or managing rights over the resource.
range: Agent
range includes: Agent
date: 2004-06-14
date: 2008-01-14
description: Recommended practice is to refer to the rights holder with a URI. If this is not possible or feasible, a literal value that identifies the rights holder may be provided.
Relation: rightsHolder-002
Has Version: rightsHolder-002
issued: 2004-06-14
Date Modified: 2008-01-14

AlekSIS
type: RunningProject
type: Proposal
type: Project
proposal name: AlekSIS
proposal status: Running
proposal website: aleksis.org
to fund: Entrust Fund

Naja
type: RunningProject
type: Proposal
type: Project
proposal name: Naja
proposal status: Running
proposal website: naja
to fund: Entrust Fund

Mailpile 2 (moggie)
type: RunningProject
type: Proposal
type: Project
proposal name: Mailpile 2 (moggie)
proposal status: Running
proposal website: moggie
to fund: Entrust Fund

creator
type: DatatypeProperty
type: Property
comment: Identify who (or what, in the case of a tool) created the SPDX document. If the SPDX document was created by an individual, indicate the person's name. If the SPDX document was created on behalf of a company or organization, indicate the entity name. If the SPDX document was created using a software tool, indicate the name and version for that tool. If multiple participants or tools were involved, use multiple instances of this field. Person name or organization name may be designated as “anonymous” if appropriate.
domain: CreationInfo
term status: stable

FABulous Demo SoC
type: Proposal
type: Project
proposal name: FABulous Demo SoC
proposal status: Selected
proposal website: FABulous
to fund: Entrust Fund

licenseException
type: Property
type: ObjectProperty
comment: An exception to a license.
domain: WithExceptionOperator
range: LicenseException
term status: stable

Handling Data from IPv6 Scanning
type: CompletedProject
type: Proposal
type: Project
proposal name: Handling Data from IPv6 Scanning
proposal status: Complete
proposal website: scanning.sba-research.org
to fund: Discovery Fund

KiCad
type: Proposal
type: Project
proposal name: KiCad
proposal status: Selected
proposal website: www.kicad.org
to fund: Core Fund

Abstract result
type: Class
comment: The base class of validation results, typically not instantiated directly.
subclass of: Resource

pcb-rnd
type: CompletedProject
type: Proposal
type: Project
proposal name: pcb-rnd
proposal status: Complete
proposal website: pcb-rnd
to fund: PET Fund

object
type: Property
comment: An expression producing the nodes that shall be inferred as objects.
domain: A rule based on triple (subject, predicate, object) pattern.

description of service end-point
type: ObjectProperty
type: Property
comment: Popis přístupového bodu služby včetně operací, parametrů apod. @cs
comment: A description of the service end-point, including its operations, parameters etc.
comment: Una descrizione dell'endpoint del servizio, incluse le sue operazioni, parametri, ecc. @it
comment: Una descripción del end-point del servicio, incluyendo sus operaciones, parámetros, etc. @es
comment: En beskrivelse af det pågældende tjenesteendpoint, inklusiv dets operationer, parametre etc. @da
domain: Data service
label: descrizione dell'endpoint del servizio @it
label: popis přístupového bodu služby @cs
label: descripción del end-point del servicio @es
label: endpointbeskrivelse @da
change note: Nová vlastnost přidaná ve verzi DCAT 2.0. @cs
change note: New property in DCAT 2.0.
change note: Ny egenskab i DCAT 2.0. @da
change note: Nueva propiedad agregada en DCAT 2.0.
change note: Nuova proprietà in DCAT 2.0. @it
definition: Una descripción del end-point del servicio, incluyendo sus operaciones, parámetros, etc.. @es
scope note: Endpointbeskrivelsen giver specifikke oplysninger om den konkrete endpointinstans, mens dct:conformsTo anvendes til at indikere den overordnede standard eller specifikation som endpointet er i overensstemmelse med. @da
scope note: An endpoint description may be expressed in a machine-readable form, such as an OpenAPI (Swagger) description, an OGC GetCapabilities response, a SPARQL Service Description, an OpenSearch or WSDL document, a Hydra API description, else in text or some other informal mode if a formal representation is not possible.
scope note: Popis přístupového bodu může být vyjádřen ve strojově čitelné formě, například jako popis OpenAPI (Swagger), odpověď služby OGC getCapabilities, pomocí slovníku SPARQL Service Description, jako OpenSearch či WSDL document, jako popis API dle slovníku Hydra, a nebo textově nebo jiným neformálním způsobem, pokud není možno použít formální reprezentaci. @cs
scope note: En beskrivelse af et endpoint kan udtrykkes i et maskinlæsbart format, såsom OpenAPI (Swagger)-beskrivelser, et OGC GetCapabilities svar, en SPARQL tjenestebeskrivelse, en OpenSearch- eller et WSDL-dokument, en Hydra-API-beskrivelse, eller i tekstformat eller i et andet uformelt format, hvis en formel repræsentation ikke er mulig. @da
scope note: La descrizione dell'endpoint fornisce dettagli specifici dell'istanza dell'endpoint reale, mentre dct:conformsTo viene utilizzato per indicare lo standard o le specifiche implementate dall'endpoint. @it
scope note: Una descripción del endpoint del servicio puede expresarse en un formato que la máquina puede interpretar, tal como una descripción basada en OpenAPI (Swagger), una respuesta OGC GetCapabilities, una descripción de un servicio SPARQL, un documento OpenSearch o WSDL, una descripción con la Hydra API, o en texto u otro modo informal si la representación formal no es posible. @es
scope note: The endpoint description gives specific details of the actual endpoint instance, while dct:conformsTo is used to indicate the general standard or specification that the endpoint implements.
scope note: Popis přístupového bodu dává specifické detaily jeho konkrétní instance, zatímco dct:conformsTo indikuje obecný standard či specifikaci kterou přístupový bod implementuje. @cs
scope note: La descripción del endpoint brinda detalles específicos de la instancia del endpoint, mientras que dct:conformsTo se usa para indicar el estándar general o especificación que implementa el endpoint. @es
scope note: Una descrizione dell'endpoint può essere espressa in un formato leggibile dalla macchina, come una descrizione OpenAPI (Swagger), una risposta GetCapabilities OGC, una descrizione del servizio SPARQL, un documento OpenSearch o WSDL, una descrizione API Hydra, o con del testo o qualche altra modalità informale se una rappresentazione formale non è possibile. @it

Simmel
type: CompletedProject
type: Proposal
type: Project
proposal name: Simmel
proposal status: Complete
proposal website: simmel.betrusted.io
to fund: Discovery Fund

Stubby
type: CompletedProject
type: Proposal
type: Project
proposal name: Stubby
proposal status: Complete
proposal website: DNS+Privacy+Daemon+-+Stubby
to fund: InternetHardeningFund

source constraint
type: Property
comment: The constraint that was validated when the result was produced.
domain: Abstract result

endPointer
type: Property
type: ObjectProperty
domain: CompoundPointer
range: SinglePointer
term status: stable

Temporal Coverage
type: Property
comment: Temporal characteristics of the resource.
range: Period of Time
subPropertyOf: Coverage
range includes: Period of Time
date: 2008-01-14
date: 2000-07-11
Relation: temporal-003
Has Version: temporal-003
issued: 2000-07-11
Date Modified: 2008-01-14

Mangaki
type: CompletedProject
type: Proposal
type: Project
proposal name: Mangaki
proposal status: Complete
proposal website: mangaki.fr
to fund: Discovery Fund

disjointUnionOf
type: Property
comment: The property that determines that a given class is equivalent to the disjoint union of a collection of other classes.
domain: Class
range: List

cc
type: Property
type: ObjectProperty
comment: Identifies an Object that is part of the public secondary audience of this Object.
domain: Object
range: Class
  unionOf: Object
  unionOf: Link

Date Created
type: Property
comment: Date of creation of the resource.
subPropertyOf: Date
date: 2000-07-11
date: 2008-01-14
description: Recommended practice is to describe the date, date/time, or period of time as recommended for the property Date, of which this is a subproperty.
Relation: created-003
Has Version: created-003
issued: 2000-07-11
Date Modified: 2008-01-14

Dino
type: CompletedProject
type: Proposal
type: Project
proposal name: Dino
proposal status: Complete
proposal website: dino.im
to fund: PET Fund

outbox
type: FunctionalProperty
type: Property
type: ObjectProperty
comment: The object's activity outbox (ordered, but order is undefined?)
domain: Actor
range: OrderedActivityCollection

Node kind
type: Class
comment: The class of all node kinds, including sh:BlankNode, sh:IRI, sh:Literal or the combinations of these: sh:BlankNodeOrIRI, sh:BlankNodeOrLiteral, sh:IRIOrLiteral.
subclass of: Resource

Software vulnerability discovery
type: CompletedProject
type: Proposal
type: Project
proposal name: Software vulnerability discovery
proposal status: Complete
proposal website: nixpkgs-update
to fund: Discovery Fund

name
type: Property
type: DatatypeProperty
domain: Class
  unionOf: Object
  unionOf: Link
name: The default, plain-text display name of the object or link.
range: Class
  unionOf: langString
  unionOf: string

documentation
type: Property
type: DatatypeProperty
comment: Website containing the documentation related to the repository identifier
domain: ReferenceType
term status: stable

Porting Guix to Riscv64
type: Proposal
type: Project
proposal name: Porting Guix to Riscv64
proposal status: Selected
proposal website: guix.gnu.org
to fund: Assure Fund

PixelDroid/Media editor
type: RunningProject
type: Proposal
type: Project
proposal name: PixelDroid/Media editor
proposal status: Running
proposal website: pixeldroid.org
to fund: Entrust Fund

checksumAlgorithm sha512
type: ChecksumAlgorithm
type: Thing
type: NamedIndividual
comment: Indicates the algorithm used was SHA512
term status: stable

Pixelfed Live
type: CompletedProject
type: Proposal
type: Project
proposal name: Pixelfed Live
proposal status: Complete
proposal website: pixelfed.org
to fund: Discovery Fund

target objects of
type: Property
comment: Links a shape to a property, indicating that all all objects of triples that have the given property as their predicate must conform to the shape.
domain: Shape
range: Property

relationship
type: Property
type: ObjectProperty
comment: Defines a relationship between two SPDX elements. The SPDX element may be a Package, File, or SpdxDocument.
domain: SpdxElement
range: Relationship
term status: stable

FileSender
type: CompletedProject
type: Proposal
type: Project
proposal name: FileSender
proposal status: Complete
proposal website: filesender.org
to fund: FileSender

Plaudit
type: CompletedProject
type: Proposal
type: Project
proposal name: Plaudit
proposal status: Complete
proposal website: plaudit.pub
to fund: Discovery Fund

Aerogramme
type: RunningProject
type: Proposal
type: Project
proposal name: Aerogramme
proposal status: Running
proposal website: aerogramme.deuxfleurs.fr
to fund: Assure Fund

Modular CA
type: CompletedProject
type: Proposal
type: Project
proposal name: Modular CA
proposal status: Complete
proposal website: redwax.eu
to fund: InternetHardeningFund

How AdTech works
type: CompletedProject
type: Proposal
type: Project
proposal name: How AdTech works
proposal status: Complete
proposal website: edri.org
to fund: NREN

max exclusive
type: Property
comment: Specifies the maximum exclusive value of each value node.

PGP4civiCRM
type: Proposal
type: Project
proposal name: PGP4civiCRM
proposal status: Selected
proposal website: civicrm.org
to fund: PET Fund

dataLicense
type: FunctionalProperty
type: Property
type: ObjectProperty
comment: Compliance with the SPDX specification includes populating the SPDX fields therein with data related to such fields ("SPDX-Metadata"). The SPDX specification contains numerous fields where an SPDX document creator may provide relevant explanatory text in SPDX-Metadata. Without opining on the lawfulness of "database rights" (in jurisdictions where applicable), such explanatory text is copyrightable subject matter in most Berne Convention countries. By using the SPDX specification, or any portion hereof, you hereby agree that any copyright rights (as determined by your jurisdiction) in any SPDX-Metadata, including without limitation explanatory text, shall be subject to the terms of the Creative Commons CC0 1.0 Universal license. For SPDX-Metadata not containing any copyright rights, you hereby agree and acknowledge that the SPDX-Metadata is provided to you "as-is" and without any representations or warranties of any kind concerning the SPDX-Metadata, express, implied, statutory or otherwise, including without limitation warranties of title, merchantability, fitness for a particular purpose, non-infringement, or the absence of latent or other defects, accuracy, or the presence or absence of errors, whether or not discoverable, all to the greatest extent permissible under applicable law.
domain: SpdxDocument
range: Class
  type: Restriction
  hasValue: CC0-1.0
  onProperty: dataLicense
term status: stable

Provenance
type: Property
comment: A statement of any changes in ownership and custody of the resource since its creation that are significant for its authenticity, integrity, and interpretation.
range: Provenance Statement
range includes: Provenance Statement
date: 2008-01-14
date: 2004-09-20
description: The statement may include a description of any changes successive custodians made to the resource.
Relation: provenance-002
Has Version: provenance-002
issued: 2004-09-20
Date Modified: 2008-01-14

IRMA made easy
type: CompletedProject
type: Proposal
type: Project
proposal name: IRMA made easy
proposal status: Complete
proposal website: irma.app
to fund: PET Fund

p2panda
type: RunningProject
type: Proposal
type: Project
proposal name: p2panda
proposal status: Running
proposal website: p2panda.org
to fund: Assure Fund

Mobile Test Farm
type: CompletedProject
type: Proposal
type: Project
proposal name: Mobile Test Farm
proposal status: Complete
proposal website: postmarketos.org
to fund: PET Fund

Rule
type: Class
comment: The class of SHACL rules. Never instantiated directly.
subclass of: Resource

relationshipType metafileOf
type: RelationshipType
type: Thing
type: NamedIndividual
comment: To be used when SPDXRef-A is a metafile of SPDXRef-B.
term status: stable

Himalaya
type: CompletedProject
type: Proposal
type: Project
proposal name: Himalaya
proposal status: Complete
proposal website: himalaya
to fund: Assure Fund

IntransitiveActivity
type: Class
comment: An Activity that has no direct object
subclass of: Activity
subclass of: Class
  type: Restriction
  maxCardinality: 0
  onProperty: object

GNU Guix - Cuirass
type: CompletedProject
type: Proposal
type: Project
proposal name: GNU Guix - Cuirass
proposal status: Complete
proposal website: Continuous-Integration.html
to fund: PET Fund

Haphaestus
type: RunningProject
type: Proposal
type: Project
proposal name: Haphaestus
proposal status: Running
proposal website: tv
to fund: Entrust Fund

alternative path
type: Property
comment: The (single) value of this property must be a list of path elements, representing the elements of alternative paths.
range: List

onProperty
type: Property
comment: The property that determines the property that a property restriction refers to.
domain: Restriction
range: Property

Librecast Live
type: CompletedProject
type: Proposal
type: Project
proposal name: Librecast Live
proposal status: Complete
proposal website: librecast.net
to fund: Discovery Fund

Type
type: Property
comment: The nature or genre of the resource.
range: Class
subPropertyOf: Type
date: 2008-01-14
description: Recommended practice is to use a controlled vocabulary such as the DCMI Type Vocabulary [[DCMI-TYPE](http://dublincore.org/documents/dcmi-type-vocabulary/)]. To describe the file format, physical medium, or dimensions of the resource, use the property Format.
description: Recommended best practice is to use a controlled vocabulary such as the DCMI Type Vocabulary [DCMITYPE]. To describe the file format, physical medium, or dimensions of the resource, use the Format element.
Relation: typeT-001
Has Version: typeT-001
issued: 2008-01-14
Date Modified: 2008-01-14

fileType
type: Property
type: ObjectProperty
comment: The type of the file.
domain: File
term status: stable

Securing Decentralised Live Information with m-ld
type: Proposal
type: Project
proposal name: Securing Decentralised Live Information with m-ld
proposal status: Selected
proposal website: m-ld.org
to fund: Assure Fund

deprecatedVersion
type: Property
type: DatatypeProperty
comment: License list version where this license was decprecated
domain: Class
  unionOf: ListedLicense
  unionOf: ListedLicenseException
term status: stable

Securing PLCs via embedded protocol adapters
type: Proposal
type: Project
proposal name: Securing PLCs via embedded protocol adapters
proposal status: Selected
proposal website: plc4x.apache.org
proposal website: mynewt.apache.org
to fund: PET Fund

Atomic Tables
type: RunningProject
type: Proposal
type: Project
proposal name: Atomic Tables
proposal status: Running
proposal website: atomic-data-rust
to fund: Entrust Fund

ForgeFed
type: RunningProject
type: Proposal
type: Project
proposal name: ForgeFed
proposal status: Running
proposal website: forgefed.org
to fund: Entrust Fund

Zilch
type: RunningProject
type: Proposal
type: Project
proposal name: Zilch
proposal status: Running
proposal website: zilch
to fund: Core Fund

hasEndSelector
type: Property
comment: The relationship between a RangeSelector and the Selector that describes the end position of the range.
domain: RangeSelector
range: Selector

Conversations 3.0
type: RunningProject
type: Proposal
type: Project
proposal name: Conversations 3.0
proposal status: Running
proposal website: conversations.im
to fund: Assure Fund

partOf
type: FunctionalProperty
type: Property
type: ObjectProperty
comment: Identifies the Collection to which a CollectionPage objects items belong.
domain: CollectionPage
range: Class
  unionOf: Collection
  unionOf: Link

Is Replaced By
type: Property
comment: A related resource that supplants, displaces, or supersedes the described resource.
subPropertyOf: Relation
date: 2008-01-14
date: 2000-07-11
description: This property is intended to be used with non-literal values. This property is an inverse property of Replaces.
Relation: isReplacedBy-003
Has Version: isReplacedBy-003
issued: 2000-07-11
Date Modified: 2008-01-14
note: This term is intended to be used with non-literal values as defined in the DCMI Abstract Model (http://dublincore.org/documents/abstract-model/). As of December 2007, the DCMI Usage Board is seeking a way to express this intention with a formal range declaration.

openXC7
type: Proposal
type: Project
proposal name: openXC7
proposal status: Selected
proposal website: OpenXC7
to fund: Entrust Fund

mediaType
type: FunctionalProperty
type: Property
type: DatatypeProperty
comment: The MIME Media Type
domain: Class
  unionOf: Link
  unionOf: Object

Read
type: Class
comment: The actor read the object
subclass of: Activity

Libre-SOC OpenPOWER ISA WG
type: RunningProject
type: Proposal
type: Project
proposal name: Libre-SOC OpenPOWER ISA WG
proposal status: Running
proposal website: nlnet 2022 opf isa wg
to fund: Entrust Fund

IMT
type: VocabularyEncodingScheme
comment: The set of media types specified by the Internet Assigned Numbers Authority.
date: 2008-01-14
date: 2000-07-11
Relation: IMT-004
Has Version: IMT-004
issued: 2000-07-11
Date Modified: 2008-01-14

Proper Webcam support in Qemu
type: Proposal
type: Project
proposal name: Proper Webcam support in Qemu
proposal status: Selected
proposal website: qemu
to fund: Core Fund

Great Black Swamp
type: RunningProject
type: Proposal
type: Project
proposal name: Great Black Swamp
proposal status: Running
proposal website: tahoe-lafs.readthedocs.io
to fund: Assure Fund

Open Hospitality Network
type: CompletedProject
type: Proposal
type: Project
proposal name: Open Hospitality Network
proposal status: Complete
proposal website: FediHospEx.github.io
to fund: Discovery Fund

LIP6 VLSI Tools
type: RunningProject
type: Proposal
type: Project
proposal name: LIP6 VLSI Tools
proposal status: Running
proposal website: nlnet 2021 lip6 vlsi
to fund: Assure Fund

Prosody IM
type: RunningProject
type: Proposal
type: Project
proposal name: Prosody IM
proposal status: Running
proposal website: prosody.im
to fund: Assure Fund

IPDL
type: RunningProject
type: Proposal
type: Project
proposal name: IPDL
proposal status: Running
proposal website: IPDL-Maude
to fund: Assure Fund

Property
type: Class
comment: The class of RDF properties.
subclass of: Resource

Or constraint component
type: Parameterizable
type: Constraint component
comment: A constraint component that can be used to restrict the value nodes so that they conform to at least one out of several provided shapes.
parameter: OrConstraintComponent-or

fileType binary
type: Thing
type: NamedIndividual
type: FileType
comment: Indicates the file is not a text file. spdx:filetype_archive is preferred for archive files even though they are binary.
term status: stable

DeltaBot
type: CompletedProject
type: Proposal
type: Project
proposal name: DeltaBot
proposal status: Complete
proposal website: delta.chat
to fund: Discovery Fund

relationshipType dependencyManifestOf
type: RelationshipType
type: Thing
type: NamedIndividual
comment: Is to be used when SPDXRef-A is a manifest file that lists a set of dependencies for SPDXRef-B.
term status: stable

Cryptech
type: Proposal
type: Project
proposal name: Cryptech
proposal status: Selected
proposal website: cryptech.is
to fund: Cryptech

Coko Docs
type: RunningProject
type: Proposal
type: Project
proposal name: Coko Docs
proposal status: Running
proposal website: community
to fund: Assure Fund

jaq
type: RunningProject
type: Proposal
type: Project
proposal name: jaq
proposal status: Running
proposal website: jaq
to fund: Entrust Fund

AI-VPN
type: CompletedProject
type: Proposal
type: Project
proposal name: AI-VPN
proposal status: Complete
proposal website: emergency-vpn
to fund: PET Fund

tag
type: Property
type: ObjectProperty
comment: One or more "tags" that have been associated with an objects. A tag can be any kind of Object. The key difference between attachment and tag is that the former implies association by inclusion, while the latter implies associated by reference.
domain: Object
range: Class
  unionOf: Object
  unionOf: Link

Object
type: Class
comment: Describes an object of any kind. The Object type serves as the base type for most of the other kinds of objects defined in the Activity Vocabulary

OrderedCollection
type: Class
comment: A variation of Collection in which items are strictly ordered
subclass of: Class
  intersectionOf: Collection
  intersectionOf: Class
    type: Restriction
    allValuesFrom: Class
      intersectionOf: OrderedItems
      intersectionOf: Class
        complementOf: Class
    onProperty: items

Opaque Sphinx Server and Clients
type: CompletedProject
type: Proposal
type: Project
proposal name: Opaque Sphinx Server and Clients
proposal status: Complete
proposal website: libsphinx
to fund: PET Fund

fediverse.space
type: CompletedProject
type: Proposal
type: Project
proposal name: fediverse.space
proposal status: Complete
proposal website: fediverse.space
to fund: Discovery Fund

Property group
type: Class
comment: Instances of this class represent groups of property shapes that belong together.
subclass of: Resource

AEAP
type: CompletedProject
type: Proposal
type: Project
proposal name: AEAP
proposal status: Complete
proposal website: delta.chat
to fund: Discovery Fund

Perspectives: Making Models
type: RunningProject
type: Proposal
type: Project
proposal name: Perspectives: Making Models
proposal status: Running
proposal website: perspectives-documentation
to fund: Entrust Fund

shapes graph well-formed
type: Property
comment: If true then the validation engine was certain that the shapes graph has passed all SHACL syntax requirements during the validation process.
domain: Validation report

Medium
type: Property
comment: The material or physical carrier of the resource.
domain: Physical Resource
range: Physical Medium
subPropertyOf: Format
domain includes: Physical Resource
range includes: Physical Medium
date: 2000-07-11
date: 2008-01-14
Relation: medium-003
Has Version: medium-003
issued: 2000-07-11
Date Modified: 2008-01-14

Briar
type: CompletedProject
type: Proposal
type: Project
proposal name: Briar
proposal status: Complete
proposal website: briarproject.org
to fund: PET Fund

describing
type: Concept
type: Motivation
comment: The motivation for when the user intends to describe the Target, as opposed to a comment about them.

binary-analysis-ng improvements
type: CompletedProject
type: Proposal
type: Project
proposal name: binary-analysis-ng improvements
proposal status: Complete
proposal website: binaryanalysis-ng
to fund: BinaryAnalysisFund

Hardware accelerated 2D graphics
type: RunningProject
type: Proposal
type: Project
proposal name: Hardware accelerated 2D graphics
proposal status: Running
proposal website: gpu2d
to fund: Entrust Fund

severity
type: Property
comment: Defines the severity that validation results produced by a shape must have. Defaults to sh:Violation.
domain: Shape
range: Severity

SPARQL CONSTRUCT rule
type: Class
comment: The class of SHACL rules based on SPARQL CONSTRUCT queries.
subclass of: SPARQL CONSTRUCT executable
subclass of: Rule

KiKit
type: RunningProject
type: Proposal
type: Project
proposal name: KiKit
proposal status: Running
proposal website: KiKit
to fund: Entrust Fund

purpose file
type: Purpose
type: Thing
type: NamedIndividual
comment: The package is a single file which can be independently distributed (configuration file, statically linked binary, Kubernetes deployment, etc).
term status: stable

Raptor Lake Desktop
type: CompletedProject
type: Proposal
type: Project
proposal name: Raptor Lake Desktop
proposal status: Complete
proposal website: overview
to fund: Entrust Fund

describesPackage
type: Property
type: ObjectProperty
comment: The describesPackage property relates an SpdxDocument to the package which it describes.
domain: SpdxDocument
range: Package
term status: stable

Max-count constraint component
type: Parameterizable
type: Constraint component
comment: A constraint component that can be used to restrict the maximum number of value nodes.
parameter: MaxCountConstraintComponent-maxCount

assertionProperty
type: Property
comment: The property that determines the predicate of a negative property assertion.
domain: NegativePropertyAssertion
range: Property

checksumAlgorithm blake2b512
type: ChecksumAlgorithm
type: Thing
type: NamedIndividual
comment: Indicates the algorithm used was BLAKE2b-512.
term status: stable

relationshipType prerequisiteFor
type: RelationshipType
type: Thing
type: NamedIndividual
comment: Is to be used when SPDXRef-A is a prerequisite for SPDXRef-B
term status: stable

ForgeFed
type: CompletedProject
type: Proposal
type: Project
proposal name: ForgeFed
proposal status: Complete
proposal website: forgefed
to fund: Discovery Fund

UDC
type: VocabularyEncodingScheme
comment: The set of conceptual resources specified by the Universal Decimal Classification.
date: 2000-07-11
date: 2008-01-14
Relation: UDC-003
Has Version: UDC-003
issued: 2000-07-11
Date Modified: 2008-01-14

a
type: FunctionalProperty
type: Property
type: ObjectProperty
comment: On a Relationship object, identifies the subject. e.g. when saying "John is connected to Sally", 'subject' refers to 'John'
domain: Relationship
range: Class
  unionOf: Link
  unionOf: Object
subPropertyOf: subject

classifying
type: Concept
type: Motivation
comment: The motivation for when the user intends to that classify the Target as something.

Betrusted software
type: CompletedProject
type: Proposal
type: Project
proposal name: Betrusted software
proposal status: Complete
proposal website: sigtxt
to fund: PET Fund

Place
type: Class
comment: A physical or logical location
subclass of: Object

EEZ flow for EEZ Studio IV
type: RunningProject
type: Proposal
type: Project
proposal name: EEZ flow for EEZ Studio IV
proposal status: Running
proposal website: www.envox.eu
to fund: Entrust Fund

SDCC
type: RunningProject
type: Proposal
type: Project
proposal name: SDCC
proposal status: Running
proposal website: sdcc.sourceforge.net
to fund: Entrust Fund

Pleroma
type: RunningProject
type: Proposal
type: Project
proposal name: Pleroma
proposal status: Running
proposal website: pleroma.social
to fund: Core Fund

isWayBackLink
type: DatatypeProperty
type: Property
comment: True if the License SeeAlso URL points to a Wayback archive
domain: CrossRef

Purpose
type: Class
comment: Package Purpose is intrinsic to how the package is being used rather than the content of the package.
term status: stable

Katzenpost
type: CompletedProject
type: Proposal
type: Project
proposal name: Katzenpost
proposal status: Complete
proposal website: katzenpost.mixnetworks.org
to fund: PET Fund

Mobroute
type: RunningProject
type: Proposal
type: Project
proposal name: Mobroute
proposal status: Running
proposal website: mobroute
to fund: Entrust Fund

OntologyProperty
type: Class
comment: The class of ontology properties.
subclass of: Property

Shuji Kamitsuna
type: Agent

onProperties
type: Property
comment: The property that determines the n-tuple of properties that a property restriction on an n-ary data range refers to.
domain: Restriction
range: List

result severity
type: Property
comment: The severity of the result, e.g. warning.
domain: Abstract result
range: Severity

URL Frontier 2.0
type: CompletedProject
type: Proposal
type: Project
proposal name: URL Frontier 2.0
proposal status: Complete
proposal website: url-frontier
to fund: Discovery Fund

Shape
type: Class
comment: A shape is a collection of constraints that may be targeted for certain nodes.
subclass of: Resource

range
type: Property
type: ObjectProperty
comment: This field defines the byte range in the original host file (in X.2) that the snippet information applies to
domain: Snippet
range: StartEndPointer
term status: stable

ask
type: Property
comment: The SPARQL ASK query to execute.
domain: SPARQL ASK executable

MobileAtlas
type: RunningProject
type: Proposal
type: Project
proposal name: MobileAtlas
proposal status: Running
proposal website: www.mobileatlas.eu
to fund: Entrust Fund

Wireguard Windows client
type: CompletedProject
type: Proposal
type: Project
proposal name: Wireguard Windows client
proposal status: Complete
proposal website: www.wireguard.com
to fund: PET Fund

Manyverse Private Groups
type: RunningProject
type: Proposal
type: Project
proposal name: Manyverse Private Groups
proposal status: Running
proposal website: manyver.se
to fund: Assure Fund

Table Of Contents
type: Property
comment: A list of subunits of the resource.
subPropertyOf: Description
date: 2008-01-14
date: 2000-07-11
Relation: tableOfContents-003
Has Version: tableOfContents-003
issued: 2000-07-11
Date Modified: 2008-01-14

extractedText
type: Property
type: DatatypeProperty
comment: Provide a copy of the actual text of the license reference extracted from the package, file or snippet that is associated with the License Identifier to aid in future analysis.
domain: ExtractedLicensingInfo
term status: stable

Federated Task-Tracking with Live Data
type: RunningProject
type: Proposal
type: Project
proposal name: Federated Task-Tracking with Live Data
proposal status: Running
proposal website: task-tracking
to fund: Assure Fund

License
type: Class
comment: A License represents a copyright license. The SPDX license list website is annotated with these properties (using RDFa) to allow license data published there to be easily processed. The license list is populated in accordance with the License List fields guidelines. These guidelines are not normative and may change over time. SPDX tooling should not rely on values in the license list conforming to the current guidelines.
subclass of: SimpleLicensingInfo
subclass of: Class
  type: Restriction
  maxQualifiedCardinality: 1
  onDataRange: boolean
  onProperty: isFsfLibre
subclass of: Class
  type: Restriction
  onDataRange: boolean
  onProperty: isOsiApproved
  qualifiedCardinality: 1
subclass of: Class
  type: Restriction
  maxQualifiedCardinality: 1
  onDataRange: boolean
  onProperty: isDeprecatedLicenseId
subclass of: Class
  type: Restriction
  maxQualifiedCardinality: 1
  onDataRange: string
  onProperty: standardLicenseHeaderTemplate
subclass of: Class
  type: Restriction
  maxQualifiedCardinality: 1
  onDataRange: string
  onProperty: standardLicenseHeader
subclass of: Class
  type: Restriction
  onDataRange: string
  onProperty: licenseText
  qualifiedCardinality: 1
subclass of: Class
  type: Restriction
  maxQualifiedCardinality: 1
  onDataRange: string
  onProperty: standardLicenseTemplate
term status: stable

relationshipType dynamicLink
type: RelationshipType
type: Thing
type: NamedIndividual
comment: Is to be used when SPDXRef-A dynamically links to SPDXRef-B.
term status: stable

checksumAlgorithm sha3 384
type: ChecksumAlgorithm
type: Thing
type: NamedIndividual
comment: Indicates the algorithm used was SHA3-384.
term status: stable

Other
fund label: Other
fund status: Open
proposals accepted: 1
proposals submitted: 69

Interpeer
type: CompletedProject
type: Proposal
type: Project
proposal name: Interpeer
proposal status: Complete
proposal website: interpeer.io
to fund: Discovery Fund

W3C-DTF
type: Class
type: Datatype
comment: The set of dates and times constructed according to the W3C Date and Time Formats Specification.
date: 2000-07-11
date: 2008-01-14
Relation: W3CDTF-003
Has Version: W3CDTF-003
issued: 2000-07-11
Date Modified: 2008-01-14

Sylk Client
type: CompletedProject
type: Proposal
type: Project
proposal name: Sylk Client
proposal status: Complete
proposal website: sylkserver.com
to fund: PET Fund

Oil Shell
type: CompletedProject
type: Proposal
type: Project
proposal name: Oil Shell
proposal status: Complete
proposal website: www.oilshell.org
to fund: Assure Fund

questioning
type: Concept
type: Motivation
comment: The motivation for when the user intends to ask a question about the Target.

Choice
type: Class
comment: A subClass of as:OrderedCollection that conveys to a consuming application that it should select one of the resources in the as:items list to use, rather than all of them. This is typically used to provide a choice of resources to render to the user, based on further supplied properties. If the consuming application cannot determine the user's preference, then it should use the first in the list.
subclass of: OrderedCollection

Agent Class
type: Class
comment: A group of agents.
subclass of: Class
date: 2012-06-14
date: 2008-01-14
description: Examples of Agent Class include groups seen as classes, such as students, women, charities, lecturers.
Relation: AgentClass-003
Has Version: AgentClass-003
issued: 2008-01-14
Date Modified: 2012-06-14

Trust semantic learning and monitoring
type: Proposal
type: Project
proposal name: Trust semantic learning and monitoring
proposal status: Selected
proposal website: markburgess.org
to fund: Assure Fund

media type
type: Property
type: ObjectProperty
comment: Esta propiedad debe ser usada cuando está definido el tipo de media de la distribución en IANA, de otra manera dct:format puede ser utilizado con diferentes valores @es
comment: Typ média distribuce definovaný v IANA. @cs
comment: Medietypen for distributionen som den er defineret af IANA. @da
comment: يجب استخدام هذه الخاصية إذا كان نوع الملف معرف ضمن IANA @ar
comment: The media type of the distribution as defined by IANA
comment: Cette propriété doit être utilisée quand c'est définit le type de média de la distribution en IANA, sinon dct:format DOIT être utilisé avec différentes valeurs. @fr
comment: Η ιδιότητα αυτή ΘΑ ΠΡΕΠΕΙ να χρησιμοποιείται όταν ο τύπος μέσου μίας διανομής είναι ορισμένος στο IANA, αλλιώς η ιδιότητα dct:format ΔΥΝΑΤΑΙ να χρησιμοποιηθεί με διαφορετικές τιμές. @el
comment: このプロパティーは、配信のメディア・タイプがIANAで定義されているときに使用すべきで（SHOULD）、そうでない場合には、dct:formatを様々な値と共に使用できます（MAY）。 @ja
comment: Il tipo di media della distribuzione come definito da IANA @it
domain: Distribution
label: tipo di media @it
label: medietype @da
label: τύπος μέσου @el
label: type de média @fr
label: メディア・タイプ @ja
label: typ média @cs
label: نوع الميديا @ar
label: tipo de media @es
range: Media Type
subPropertyOf: Format
change note: The range of dcat:mediaType has been tightened as part of the revision of DCAT.
change note: Il range di dcat:mediaType è stato ristretto come parte della revisione di DCAT. @it
change note: Obor hodnot dcat:mediaType byl zúžen v této revizi DCAT. @cs
definition: The media type of the distribution as defined by IANA.
definition: Il tipo di media della distribuzione come definito da IANA. @it
definition: Esta propiedad debe ser usada cuando está definido el tipo de media de la distribución en IANA, de otra manera dct:format puede ser utilizado con diferentes valores. @es
editorial note: Status: English Definition text modified by DCAT revision team, Italian and Czech translation provided, other translations pending. Note some inconsistency on def vs. usage.
scope note: Denne egenskab BØR anvendes hvis distributionens medietype optræder i 'IANA media types registry' https://www.iana.org/assignments/media-types/, ellers KAN egenskaben dct:format anvendes med et andet udfaldsrum. @da
scope note: This property SHOULD be used when the media type of the distribution is defined in the IANA media types registry https://www.iana.org/assignments/media-types/, otherwise dct:format MAY be used with different values.
scope note: Esta propiedad DEBERÍA usarse cuando el 'media type' de la distribución está definido en el registro IANA de 'media types' https://www.iana.org/assignments/media-types/, de lo contrario, dct:format PUEDE usarse con distintos valores. @es
scope note: Tato vlastnost BY MĚLA být použita, je-li typ média distribuce definován v registru IANA https://www.iana.org/assignments/media-types/. V ostatních případech MŮŽE být použita vlastnost dct:format s jinými hodnotami. @cs
scope note: Questa proprietà DEVE essere usata quando il tipo di media della distribuzione è definito nel registro dei tipi di media IANA https://www.iana.org/assignments/media-types/, altrimenti dct:format PUO 'essere usato con differenti valori. @it

SES - SimplyEdit Spaces
type: CompletedProject
type: Proposal
type: Project
proposal name: SES - SimplyEdit Spaces
proposal status: Complete
proposal website: www.symplyedit.nl
to fund: Assure Fund

height
type: FunctionalProperty
type: Property
type: DatatypeProperty
comment: The display height expressed as device independent pixels
domain: Link

SEARXR
type: CompletedProject
type: Proposal
type: Project
proposal name: SEARXR
proposal status: Complete
proposal website: rJ8bYBcCU
to fund: Discovery Fund

Garage
type: RunningProject
type: Proposal
type: Project
proposal name: Garage
proposal status: Running
proposal website: garagehq.deuxfleurs.fr
to fund: Entrust Fund

Wishbone Streaming
type: CompletedProject
type: Proposal
type: Project
proposal name: Wishbone Streaming
proposal status: Complete
proposal website: nlnet 2019 wishbone streaming
to fund: PET Fund

Vita
type: CompletedProject
type: Proposal
type: Project
proposal name: Vita
proposal status: Complete
proposal website: vita
to fund: InternetHardeningFund

NodeBB
type: RunningProject
type: Proposal
type: Project
proposal name: NodeBB
proposal status: Running
proposal website: nodebb
to fund: Core Fund

not
type: Property
comment: Specifies a shape that the value nodes must not conform to.
range: Shape

Distribution
type: Class
comment: Una representación específica de los datos. Cada conjunto de datos puede estar disponible en formas diferentes, las cuáles pueden variar en distintas formas, incluyendo el idioma, 'media-type' o formato, organización esquemática, resolución temporal y espacial, nivel de detalle o perfiles (que pueden especificar cualquiera o todas las diferencias anteriores). @es
comment: A specific representation of a dataset. A dataset might be available in multiple serializations that may differ in various ways, including natural language, media-type or format, schematic organization, temporal and spatial resolution, level of detail or profiles (which might specify any or all of the above).
comment: Rappresenta una forma disponibile e specifica del dataset. Ciascun dataset può essere disponibile in forme differenti, che possono rappresentare formati diversi o diversi punti di accesso per un dataset. Esempi di distribuzioni sono un file CSV scaricabile, una API o un RSS feed. @it
comment: データセットの特定の利用可能な形式を表わします。各データセットは、異なる形式で利用できることがあり、これらの形式は、データセットの異なる形式や、異なるエンドポイントを表わす可能性があります。配信の例には、ダウンロード可能なCSVファイル、API、RSSフィードが含まれます。 @ja
comment: Konkrétní reprezentace datové sady. Datová sada může být dostupná v různých serializacích, které se mohou navzájem lišit různými způsoby, mimo jiné přirozeným jazykem, media-typem či formátem, schematickou organizací, časovým a prostorovým rozlišením, úrovní detailu či profily (které mohou specifikovat některé či všechny tyto rozdíly). @cs
comment: شكل محدد لقائمة البيانات يمكن الوصول إليه. قائمة بيانات ما يمكن أن تكون متاحه باشكال و أنواع متعددة. ملف يمكن تحميله أو واجهة برمجية يمكن من خلالها الوصول إلى البيانات هي أمثلة على ذلك. @ar
comment: Αναπαριστά μία συγκεκριμένη διαθέσιμη μορφή ενός συνόλου δεδομένων. Κάθε σύνολο δεδομενων μπορεί να είναι διαθέσιμο σε διαφορετικές μορφές, οι μορφές αυτές μπορεί να αναπαριστούν διαφορετικές μορφές αρχείων ή διαφορετικά σημεία διάθεσης. Παραδείγματα διανομών συμπεριλαμβάνουν ένα μεταφορτώσιμο αρχείο μορφής CSV, ένα API ή ένα RSS feed. @el
comment: Représente une forme spécifique d'un jeu de données. Caque jeu de données peut être disponible sous différentes formes, celles-ci pouvant représenter différents formats du jeu de données ou différents endpoint. Des exemples de distribution sont des fichirs CSV, des API ou des flux RSS. @fr
comment: En specifik repræsentation af et datasæt. Et datasæt kan være tilgængelig i mange serialiseringer der kan variere på forskellige vis, herunder sprog, medietype eller format, systemorganisering, tidslig- og geografisk opløsning, detaljeringsniveau eller profiler (der kan specificere en eller flere af ovenstående). @da
label: Distribución @es
label: 配信 @ja
label: Distribuzione @it
label: Distribuce @cs
label: Διανομή @el
label: التوزيع @ar
alternative label: Datadistribution @da
alternative label: Dataudstilling @da
alternative label: Datarepræsentation @da
alternative label: Datamanifestation @da
scope note: Questa classe rappresenta una disponibilità generale di un dataset e non implica alcuna informazione sul metodo di accesso effettivo ai dati, ad esempio se si tratta di un accesso a download diretto, API, o attraverso una pagina Web. L'utilizzo della proprietà dcat:downloadURL indica distribuzioni direttamente scaricabili. @it
scope note: Toto popisuje obecnou dostupnost datové sady. Neimplikuje žádnou informaci o skutečné metodě přístupu k datům, tj. zda jsou přímo ke stažení, skrze API či přes webovou stránku. Použití vlastnosti dcat:downloadURL indikuje přímo stažitelné distribuce. @cs
scope note: This represents a general availability of a dataset it implies no information about the actual access method of the data, i.e. whether by direct download, API, or through a Web page. The use of dcat:downloadURL property indicates directly downloadable distributions.
scope note: Αυτό αναπαριστά μία γενική διαθεσιμότητα ενός συνόλου δεδομένων και δεν υπονοεί τίποτα περί του πραγματικού τρόπου πρόσβασης στα δεδομένα, αν είναι άμεσα μεταφορτώσιμα, μέσω API ή μέσω μίας ιστοσελίδας. Η χρήση της ιδιότητας dcat:downloadURL δείχνει μόνο άμεσα μεταφορτώσιμες διανομές. @el
scope note: Denne klasse repræsenterer datasættets overordnede tilgængelighed og giver ikke oplysninger om hvilken metode der kan anvendes til at få adgang til data, dvs. om adgang til datasættet realiseres ved direkte download, API eller via et websted. Anvendelsen af egenskaben dcat:downloadURL indikerer at distributionen kan downloades direkte. @da
scope note: Ceci représente une disponibilité générale du jeu de données, et implique qu'il n'existe pas d'information sur la méthode d'accès réelle des données, par exple, si c'est un lien de téléchargement direct ou à travers une page Web. @fr
scope note: これは、データセットの一般的な利用可能性を表わし、データの実際のアクセス方式に関する情報（つまり、直接ダウンロードなのか、APIなのか、ウェブページを介したものなのか）を意味しません。dcat:downloadURLプロパティーの使用は、直接ダウンロード可能な配信を意味します。 @ja
scope note: Esta clase representa una disponibilidad general de un conjunto de datos, e implica que no existe información acerca del método de acceso real a los datos, i.e., si es un enlace de descarga directa o a través de una página Web. @es

LibreSilicon
type: CompletedProject
type: Proposal
type: Project
proposal name: LibreSilicon
proposal status: Complete
proposal website: libresilicon.com
to fund: PET Fund

Standard Cell Library
type: CompletedProject
type: Proposal
type: Project
proposal name: Standard Cell Library
proposal status: Complete
proposal website: StdCellLib
to fund: PET Fund

Is Version Of
type: Property
comment: A related resource of which the described resource is a version, edition, or adaptation.
subPropertyOf: Relation
date: 2000-07-11
date: 2008-01-14
description: Changes in version imply substantive changes in content rather than differences in format. This property is intended to be used with non-literal values. This property is an inverse property of Has Version.
description: Changes in version imply substantive changes in content rather than differences in format.
Relation: isVersionOf-003
Has Version: isVersionOf-003
issued: 2000-07-11
Date Modified: 2008-01-14
note: This term is intended to be used with non-literal values as defined in the DCMI Abstract Model (http://dublincore.org/documents/abstract-model/). As of December 2007, the DCMI Usage Board is seeking a way to express this intention with a formal range declaration.

rel
type: Property
type: DatatypeProperty
comment: The RFC 5988 or HTML5 Link Relation associated with the Link
domain: Link

Invite
type: Class
comment: To invite someone or something to something
subclass of: Offer

Min-exclusive constraint component
type: Parameterizable
type: Constraint component
comment: A constraint component that can be used to restrict the range of value nodes with a minimum exclusive value.
parameter: MinExclusiveConstraintComponent-minExclusive

Arrive
type: Class
comment: To Arrive Somewhere (can be used, for instance, to indicate that a particular entity is currently located somewhere, e.g. a "check-in")
subclass of: IntransitiveActivity

inverse path
type: Property
comment: The (single) value of this property represents an inverse path (object to subject).

Reinstatement of crypto.signText()
type: RunningProject
type: Proposal
type: Project
proposal name: Reinstatement of crypto.signText()
proposal status: Running
proposal website: redwax.eu
to fund: Assure Fund

Expression constraint component
type: Parameterizable
type: Constraint component
comment: A constraint component that can be used to verify that a given node expression produces true for all value nodes.
parameter: ExpressionConstraintComponent-expression

TransitiveProperty
type: Class
comment: The class of transitive properties.
subclass of: ObjectProperty

Sequoia GPG Chameleon
type: RunningProject
type: Proposal
type: Project
proposal name: Sequoia GPG Chameleon
proposal status: Running
proposal website: sequoia-pgp.org
to fund: Assure Fund

Class
comment: The class of classes.
subclass of: Resource

Location
type: Class
comment: A spatial region or named place.
subclass of: Location, Period, or Jurisdiction
date: 2008-01-14
Relation: Location-001
Has Version: Location-001
issued: 2008-01-14

Lemmy Federation
type: Proposal
type: Project
proposal name: Lemmy Federation
proposal status: Selected
proposal website: join.lemmy.ml
to fund: Discovery Fund

description
type: DatatypeProperty
type: Property
comment: Provides a detailed description of the package.
domain: Package
term status: stable

FOSS Code Supply Chain Assurance
type: CompletedProject
type: Proposal
type: Project
proposal name: FOSS Code Supply Chain Assurance
proposal status: Complete
proposal website: AboutCode.org
to fund: Assure Fund

relationshipType dependencyOf
type: RelationshipType
type: Thing
type: NamedIndividual
comment: Is to be used when SPDXRef-A is dependency of SPDXRef-B.
term status: stable

Paolo Ciccarese
type: Agent
type: Person

Annotation
type: Class
comment: An Annotation is a comment on an SpdxItem by an agent.
subclass of: Class
  type: Restriction
  onDataRange: string
  onProperty: annotator
  qualifiedCardinality: 1
subclass of: Class
  type: Restriction
  onDataRange: dateTime
  onProperty: annotationDate
  qualifiedCardinality: 1
subclass of: Class
  type: Restriction
  onClass: AnnotationType
  onProperty: annotationType
  qualifiedCardinality: 1
subclass of: Class
  type: Restriction
  onDataRange: string
  onProperty: comment
  qualifiedCardinality: 1
term status: stable

DCMI Box
type: Class
type: Datatype
comment: The set of regions in space defined by their geographic coordinates according to the DCMI Box Encoding Scheme.
date: 2008-01-14
date: 2000-07-11
Relation: Box-003
Has Version: Box-003
issued: 2000-07-11
Date Modified: 2008-01-14

Tauri Apps
type: CompletedProject
type: Proposal
type: Project
proposal name: Tauri Apps
proposal status: Complete
proposal website: tauri.studio
to fund: Assure Fund

sourceDate
type: Property
comment: The timestamp at which the Source resource should be interpreted as being applicable to the Annotation.
domain: TimeState
range: dateTime

Private Key Operations for Keyoxide
type: CompletedProject
type: Proposal
type: Project
proposal name: Private Key Operations for Keyoxide
proposal status: Complete
proposal website: keyoxide.org
to fund: Assure Fund

Identifier
type: Property
comment: An unambiguous reference to the resource within a given context.
date: 1999-07-02
description: Recommended practice is to identify the resource by means of a string conforming to an identification system.
issued: 1999-07-02
note: A [second property](/specifications/dublin-core/dcmi-terms/#http://purl.org/dc/terms/identifier) with the same name as this property has been declared in the [dcterms: namespace](http://purl.org/dc/terms/). See the Introduction to the document [DCMI Metadata Terms](/specifications/dublin-core/dcmi-terms/) for an explanation.

Node-kind constraint component
type: Parameterizable
type: Constraint component
comment: A constraint component that can be used to restrict the RDF node kind of each value node.
parameter: NodeKindConstraintComponent-nodeKind

relationshipType testDependencyOf
type: RelationshipType
type: Thing
type: NamedIndividual
comment: Is to be used when SPDXRef-A is a test dependency of SPDXRef-B.
term status: stable

checksumAlgorithm sha256
type: ChecksumAlgorithm
type: Thing
type: NamedIndividual
comment: Indicates the algorithm used was SHA256
term status: stable

object
type: Property
comment: The object of the subject RDF statement.
domain: Statement

Protomaps
type: RunningProject
type: Proposal
type: Project
proposal name: Protomaps
proposal status: Running
proposal website: protomaps.com
to fund: Core Fund

Lemmy Scale
type: Proposal
type: Project
proposal name: Lemmy Scale
proposal status: Selected
proposal website: join-lemmy.org
to fund: Core Fund

Waasabi Framework
type: CompletedProject
type: Proposal
type: Project
proposal name: Waasabi Framework
proposal status: Complete
proposal website: waasabi
to fund: PET Fund

Vita
type: CompletedProject
type: Proposal
type: Project
proposal name: Vita
proposal status: Complete
proposal website: vita
to fund: PET Fund

fileType application
type: Thing
type: NamedIndividual
type: FileType
comment: The file is associated with a specific application type (MIME type of application/* )
term status: stable

ExtractedLicensingInfo
type: Class
comment: An ExtractedLicensingInfo represents a license or licensing notice that was found in a package, file or snippet. Any license text that is recognized as a license may be represented as a License rather than an ExtractedLicensingInfo.
subclass of: SimpleLicensingInfo
subclass of: Class
  type: Restriction
  onDataRange: string
  onProperty: extractedText
  qualifiedCardinality: 1
term status: stable

Software Heritage listers + tooling
type: RunningProject
type: Proposal
type: Project
proposal name: Software Heritage listers + tooling
proposal status: Running
proposal website: www.softwareheritage.org
to fund: Entrust Fund

Nitrokey
type: CompletedProject
type: Proposal
type: Project
proposal name: Nitrokey
proposal status: Complete
proposal website: www.nitrokey.com
to fund: PET Fund

JavaScript target type
type: Class
comment: The (meta) class for parameterizable targets that are based on JavaScript functions.
subclass of: JavaScript executable
subclass of: Target type

Catalog
type: Class
comment: Řízená kolekce metadat o datových sadách a datových službách @cs
comment: مجموعة من توصيفات قوائم البيانات @ar
comment: A curated collection of metadata about resources (e.g., datasets and data services in the context of a data catalog).
comment: Μια επιμελημένη συλλογή μεταδεδομένων περί συνόλων δεδομένων @el
comment: Une collection élaborée de métadonnées sur les jeux de données @fr
comment: Una colección curada de metadatos sobre recursos (por ejemplo, conjuntos de datos y servicios de datos en el contexto de un catálogo de datos). @es
comment: データ・カタログは、データセットに関するキュレートされたメタデータの集合です。 @ja
comment: En udvalgt og arrangeret samling af metadata om ressourcer (fx datasæt og datatjenester i kontekst af et datakatalog). @da
comment: Una raccolta curata di metadati sulle risorse (ad es. sui dataset e relativi servizi nel contesto di cataloghi di dati). @it
label: Catalogue @fr
label: カタログ @ja
label: Κατάλογος @el
label: Katalog @cs
label: Catalogo @it
label: فهرس قوائم البيانات @ar
label: Catálogo @es
subclass of: Dataset
definition: En samling af metadata om ressourcer (fx datasæt og datatjenester i kontekst af et datakatalog). @da
definition: Řízená kolekce metadat o datových sadách a datových službách. @cs
definition: Une collection élaborée de métadonnées sur les jeux de données. @fr
definition: Μια επιμελημένη συλλογή μεταδεδομένων περί συνόλων δεδομένων. @el
editorial note: English, Italian, Spanish definitions updated in this revision. Multilingual text not yet updated.
scope note: Συνήθως, ένας κατάλογος δεδομένων στον Παγκόσμιο Ιστό αναπαρίσταται ως ένα στιγμιότυπο αυτής της κλάσης. @el
scope note: 通常、ウェブ・ベースのデータ・カタログは、このクラスの1つのインスタンスとして表わされます。 @ja
scope note: A web-based data catalog is typically represented as a single instance of this class.
scope note: Et webbaseret datakatalog repræsenteres typisk ved en enkelt instans af denne klasse. @da
scope note: Normalmente, un catalogo di dati nel web viene rappresentato come una singola istanza di questa classe. @it
scope note: Webový datový katalog je typicky reprezentován jako jedna instance této třídy. @cs
scope note: Normalmente, un catálogo de datos disponible en la web se representa como una única instancia de esta clase. @es

CryptPad for communities
type: CompletedProject
type: Proposal
type: Project
proposal name: CryptPad for communities
proposal status: Complete
proposal website: cryptpad.fr
to fund: PET Fund

DCMI Metadata Terms - other
type: Ontology
date: 2012-06-14
publisher: DCMI
Date Modified: 2012-06-14

Data packages
type: Proposal
type: Project
proposal name: Data packages
proposal status: Selected
proposal website: specs.frictionlessdata.io
to fund: Entrust Fund

Alternative Title
type: Property
comment: An alternative name for the resource.
subPropertyOf: Title
date: 2000-07-11
date: 2010-10-11
description: The distinction between titles and alternative titles is application-specific.
Relation: alternative-003
Has Version: alternative-003
issued: 2000-07-11
Date Modified: 2010-10-11

Babelia
type: CompletedProject
type: Proposal
type: Project
proposal name: Babelia
proposal status: Complete
proposal website: Babelia
to fund: Discovery Fund

Willow Sync
type: Proposal
type: Project
proposal name: Willow Sync
proposal status: Selected
proposal website: willowprotocol.org
to fund: Core Fund

GNU social
type: CompletedProject
type: Proposal
type: Project
proposal name: GNU social
proposal status: Complete
proposal website: gnusocial.network
to fund: Discovery Fund

pcb-rnd, sch-rnd
type: RunningProject
type: Proposal
type: Project
proposal name: pcb-rnd, sch-rnd
proposal status: Running
proposal website: pcb-rnd.repo.hu
to fund: Entrust Fund

Zerocat Chipflasher Flashrom Interface
type: CompletedProject
type: Proposal
type: Project
proposal name: Zerocat Chipflasher Flashrom Interface
proposal status: Complete
proposal website: chipflasher.html
to fund: PET Fund

Betrusted OS
type: CompletedProject
type: Proposal
type: Project
proposal name: Betrusted OS
proposal status: Complete
proposal website: betrusted.io
to fund: PET Fund

spatial resolution (meters)
type: DatatypeProperty
type: Property
comment: minimum spatial separation resolvable in a dataset, measured in metres.
comment: separazione spaziale minima risolvibile in un set di dati, misurata in metri. @it
comment: minimální prostorový rozestup rozeznatelný v datové sadě, měřeno v metrech. @cs
comment: minimum spatial separation resolvable in a dataset, measured in meters.
comment: mínima separacíon espacial disponible en un conjunto de datos, medida en metros. @es
comment: mindste geografiske afstand som kan erkendes i et datasæt, målt i meter. @da
label: prostorové rozlišení (metry) @cs
label: risoluzione spaziale (metros) @it
label: spatial resolution (metres)
label: geografisk opløsning (meter) @da
label: resolución espacial (metros) @es
range: decimal
change note: New property added in DCAT 2.0.
change note: Nová vlastnost přidaná ve verzi DCAT 2.0. @cs
change note: Nuova proprietà aggiunta in DCAT 2.0. @it
change note: Ny genskab tilføjet i DCAT 2.0. @da
change note: Nueva propiedad añadida en DCAT 2.0. @es
definition: mindste geografiske afstand som kan resolveres i et datasæt, målt i meter. @da
editorial note: Může se vyskytnout v popisu Datové sady nebo Distribuce, takže nebyl specifikován definiční obor. @cs
editorial note: Kan optræde i forbindelse med beskrivelse af datasættet eller datasætditributionen, så der er ikke angivet et domæne for egenskaben. @da
editorial note: Might appear in the description of a Dataset or a Distribution, so no domain is specified.
scope note: Si el conjunto de datos es una imágen o grilla, esta propiedad corresponde al espaciado de los elementos. Para otro tipo de conjunto de datos espaciales, esta propieda usualmente indica la menor distancia entre los elementos de dichos datos. @es
scope note: Distintas distribuciones de un conjunto de datos pueden tener resoluciones espaciales diferentes. @es
scope note: Risoluzioni spaziali alternative possono essere fornite come diverse distribuzioni di set di dati. @it
scope note: Alternative spatial resolutions might be provided as different dataset distributions.
scope note: Hvis datasættet udgøres af et billede eller et grid, så bør dette svare til afstanden mellem elementerne. For andre typer af spatiale datasæt, vil denne egenskab typisk indikere den mindste afstand mellem elementerne i datasættet. @da
scope note: Různá prostorová rozlišení mohou být poskytována jako různé distribuce datové sady. @cs
scope note: Se il set di dati è un'immagine o una griglia, questo dovrebbe corrispondere alla spaziatura degli elementi. Per altri tipi di set di dati spaziali, questa proprietà di solito indica la distanza minima tra gli elementi nel set di dati. @it
scope note: Pokud je datová sada obraz či mřížka, měla by tato vlastnost odpovídat rozestupu položek. Pro ostatní druhy prostorových datových sad bude tato vlastnost obvykle indikovat nejmenší vzdálenost mezi položkami této datové sady. @cs
scope note: Alternative geografiske opløsninger kan leveres som forskellige datasætdistributioner. @da
scope note: If the dataset is an image or grid this should correspond to the spacing of items. For other kinds of spatial dataset, this property will usually indicate the smallest distance between items in the dataset.

following
type: FunctionalProperty
type: Property
type: ObjectProperty
comment: This is a collection of other actors that an actor is following.
domain: Actor
range: Class
  unionOf: OrderedActorCollection
  unionOf: ActorCollection

JSON-Joy Peritext
type: Proposal
type: Project
proposal name: JSON-Joy Peritext
proposal status: Selected
proposal website: jsonjoy.com
to fund: Core Fund

UniqueLangConstraintComponent-uniqueLang
type: Shape
type: Property shape
type: Parameter
datatype: boolean
max count: 1
path: unique languages

Bag
type: Class
comment: The class of unordered containers.
subclass of: Container

Nextcloud
type: CompletedProject
type: Proposal
type: Project
proposal name: Nextcloud
proposal status: Complete
proposal website: nextcloud.com
to fund: Discovery Fund

followers
type: FunctionalProperty
type: Property
type: ObjectProperty
comment: This is a collection of actors that have sent a Follow activity for the actor.
domain: Actor
range: Class
  unionOf: OrderedActorCollection
  unionOf: ActorCollection

Canarytail
type: Proposal
type: Project
proposal name: Canarytail
proposal status: Selected
proposal website: canarytail.org
to fund: UOI Fund

path
type: Property
comment: Specifies the property path of a property shape.
domain: Property shape

DIME
type: CompletedProject
type: Proposal
type: Project
proposal name: DIME
proposal status: Complete
proposal website: darkmail.info
to fund: InternetHardeningFund

Great scanning and OCR for mobile devices
type: CompletedProject
type: Proposal
type: Project
proposal name: Great scanning and OCR for mobile devices
proposal status: Complete
proposal website: sane-project.org
to fund: Discovery Fund

pretalx
type: RunningProject
type: Proposal
type: Project
proposal name: pretalx
proposal status: Running
proposal website: pretalx.com
to fund: Entrust Fund

Reowolf
type: CompletedProject
type: Proposal
type: Project
proposal name: Reowolf
proposal status: Complete
proposal website: api.html
to fund: PET Fund

Reverse Engineering Toolkit
type: RunningProject
type: Proposal
type: Project
proposal name: Reverse Engineering Toolkit
proposal status: Running
proposal website: unbina.re
to fund: Entrust Fund

DeprecatedProperty
type: Class
comment: The class of deprecated properties.
subclass of: Property

Remove
type: Class
comment: To Remove Something
subclass of: Activity

LibreOffice CRDT
type: Proposal
type: Project
proposal name: LibreOffice CRDT
proposal status: Selected
proposal website: libreoffice.org
to fund: Entrust Fund

reviewDate
type: Property
type: DatatypeProperty
comment: The date and time at which the SpdxDocument was reviewed. This value must be in UTC and have 'Z' as its timezone indicator.
comment: Deprecated in favor of Annotation with an annotationType_review.
domain: Review
range: dateTime
deprecated: true
term status: deprecated

Rights Statement
type: Class
comment: A statement about the intellectual property rights (IPR) held in or over a resource, a legal document giving official permission to do something with a resource, or a statement about access rights.
comment: A statement about the intellectual property rights (IPR) held in or over a Resource, a legal document giving official permission to do something with a resource, or a statement about access rights.
date: 2008-01-14
Relation: RightsStatement-001
Has Version: RightsStatement-001
issued: 2008-01-14

Agent
type: Class
type: Agent Class
comment: A resource that acts or has the power to act.
date: 2008-01-14
description: Examples of Agent include person, organization, and software agent.
Relation: Agent-001
Has Version: Agent-001
issued: 2008-01-14

AI Horde
type: RunningProject
type: Proposal
type: Project
proposal name: AI Horde
proposal status: Running
proposal website: aihorde.net
to fund: Core Fund

Signature PDF
type: RunningProject
type: Proposal
type: Project
proposal name: Signature PDF
proposal status: Running
proposal website: signaturepdf
to fund: Assure Fund

Pattern constraint component
type: Parameterizable
type: Constraint component
comment: A constraint component that can be used to verify that every value node matches a given regular expression.
parameter: PatternConstraintComponent-flags
parameter: PatternConstraintComponent-pattern

textDirection
type: Property
comment: The direction of the text of the subject resource. There MUST only be one text direction associated with any given resource.
range: Direction

shapes graph
type: Property
comment: Shapes graphs that should be used when validating this data graph.
domain: Ontology
range: Ontology

domain
type: Property
comment: A domain of the subject property.
domain: Property
range: Class

Audio/Video Calls in Libervia
type: RunningProject
type: Proposal
type: Project
proposal name: Audio/Video Calls in Libervia
proposal status: Running
proposal website: www.salut-a-toi.org
to fund: Assure Fund

MaxLengthConstraintComponent-maxLength
type: Shape
type: Property shape
type: Parameter
datatype: integer
max count: 1
path: max length

DatatypeConstraintComponent-datatype
type: Shape
type: Property shape
type: Parameter
max count: 1
node kind: IRI
path: datatype

PatternConstraintComponent-flags
type: Shape
type: Property shape
type: Parameter
datatype: string
optional: true
path: flags

Re-isearch
type: CompletedProject
type: Proposal
type: Project
proposal name: Re-isearch
proposal status: Complete
proposal website: re-isearch
to fund: Discovery Fund

oneOf
type: Property
type: ObjectProperty
comment: Describes a possible inclusive answer or option for a question.
domain: Question
range: Class
  unionOf: Object
  unionOf: Link

Converged Security Suite +AMD
type: Proposal
type: Project
proposal name: Converged Security Suite +AMD
proposal status: Selected
proposal website: converged-security-suite
to fund: Entrust Fund

creationInfo
type: Property
type: ObjectProperty
comment: The creationInfo property relates an SpdxDocument to a set of information about the creation of the SpdxDocument.
domain: SpdxDocument
range: CreationInfo
term status: stable

Container
type: Class
comment: The class of RDF containers.
subclass of: Resource

type
type: Property
comment: The subject is an instance of a class.
domain: Resource
range: Class

Riccardo Albertoni
type: Agent

Class constraint component
type: Parameterizable
type: Constraint component
comment: A constraint component that can be used to verify that each value node is an instance of a given type.
parameter: ClassConstraintComponent-class

noticeText
type: Property
type: DatatypeProperty
comment: This field provides a place for the SPDX file creator to record potential legal notices found in the file. This may or may not include copyright statements.
domain: File
term status: stable

relationshipType patchFor
type: RelationshipType
type: Thing
type: NamedIndividual
comment: A Relationship of relationshipType_patchFor expresses that the SPDXElement is a 'patchfile' that is designed to patch (apply modifications to) the relatedSPDXElement. For example, relationship from a .diff File to a Package it is designed to patch.
term status: stable

PixelDroid
type: CompletedProject
type: Proposal
type: Project
proposal name: PixelDroid
proposal status: Complete
proposal website: pixeldroid.org
to fund: Discovery Fund

Blink RELOAD
type: CompletedProject
type: Proposal
type: Project
proposal name: Blink RELOAD
proposal status: Complete
proposal website: icanblink.com
to fund: Discovery Fund

TwPM
type: RunningProject
type: Proposal
type: Project
proposal name: TwPM
proposal status: Running
proposal website: twpm.dasharo.com
to fund: Assure Fund

Stalwart Mail Server
type: CompletedProject
type: Proposal
type: Project
proposal name: Stalwart Mail Server
proposal status: Complete
proposal website: stalw.art
to fund: Entrust Fund

cachedSource
type: Property
comment: A object of the relationship is a copy of the Source resource's representation, appropriate for the Annotation.
domain: TimeState

suggested shapes graph
type: Property
comment: Suggested shapes graphs for this ontology. The values of this property may be used in the absence of specific sh:shapesGraph statements.
domain: Ontology
range: Ontology

fileType documentation
type: Thing
type: NamedIndividual
type: FileType
comment: The file serves as documentation.
term status: stable

Libre Silicon compiler
type: CompletedProject
type: Proposal
type: Project
proposal name: Libre Silicon compiler
proposal status: Complete
proposal website: libresilicon.com
to fund: PET Fund

Earthstar (Encryption, Safety, and Local Sync)
type: RunningProject
type: Proposal
type: Project
proposal name: Earthstar (Encryption, Safety, and Local Sync)
proposal status: Running
proposal website: earthstar-project.org
to fund: Assure Fund

altitude
type: FunctionalProperty
type: Property
type: DatatypeProperty
comment: The altitude of a place
domain: Place
range: float

Namecoin: Electrum-NMC
type: RunningProject
type: Proposal
type: Project
proposal name: Namecoin: Electrum-NMC
proposal status: Running
proposal website: www.namecoin.org
to fund: Assure Fund

annotatedTarget
type: Property
comment: The property that determines the object of an annotated axiom or annotated annotation.
domain: Resource

Automated clearing of source code files
type: RunningProject
type: Proposal
type: Project
proposal name: Automated clearing of source code files
proposal status: Running
proposal website: https://www.tdcommons.org/dpubs_series/4965/
to fund: BinaryAnalysisFund

condition
type: Property
comment: The shapes that the focus nodes need to conform to before a rule is executed on them.
domain: Rule
range: Shape

Cryptech
type: Proposal
type: Project
proposal name: Cryptech
proposal status: Selected
proposal website: cryptech.is
to fund: Cryptech

object
type: ObjectProperty
type: Property
comment: When used within an Activity, describes the direct object of the activity. For instance, in the activity "John added a movie to his wishlist", the object of the activity is the movie added. When used within a Relationship describes the entity to which the subject is related.
domain: Class
  unionOf: Activity
  unionOf: Relationship
range: Class
  unionOf: Object
  unionOf: Link

In-document search
type: CompletedProject
type: Proposal
type: Project
proposal name: In-document search
proposal status: Complete
proposal website: odftoolkit
to fund: Discovery Fund

checksumAlgorithm blake2b256
type: ChecksumAlgorithm
type: Thing
type: NamedIndividual
comment: Indicates the algorithm used was BLAKE2b-256.
term status: stable

JavaScript Restrictor
type: CompletedProject
type: Proposal
type: Project
proposal name: JavaScript Restrictor
proposal status: Complete
proposal website: jsrestrictor
to fund: PET Fund

The Libre-SOC Gigabit Router
type: RunningProject
type: Proposal
type: Project
proposal name: The Libre-SOC Gigabit Router
proposal status: Running
proposal website: nlnet 2021 crypto router
to fund: Assure Fund

Owncast
type: CompletedProject
type: Proposal
type: Project
proposal name: Owncast
proposal status: Complete
proposal website: owncast.online
to fund: Discovery Fund

/kbin
type: Proposal
type: Project
proposal name: /kbin
proposal status: Selected
proposal website: kbin.pub
to fund: Entrust Fund

Real time graph database search engine
type: CompletedProject
type: Proposal
type: Project
proposal name: Real time graph database search engine
proposal status: Complete
proposal website: www.saulx.com
to fund: Discovery Fund

Nitrokey 3
type: RunningProject
type: Proposal
type: Project
proposal name: Nitrokey 3
proposal status: Running
proposal website: www.nitrokey.com
to fund: Entrust Fund

PackageVerificationCode
type: Class
comment: A manifest based verification code (the algorithm is defined in section 4.7 of the full specification) of the SPDX Item. This allows consumers of this data and/or database to determine if an SPDX item they have in hand is identical to the SPDX item from which the data was produced. This algorithm works even if the SPDX document is included in the SPDX item.
subclass of: Class
  type: Restriction
  minQualifiedCardinality: 0
  onDataRange: string
  onProperty: packageVerificationCodeExcludedFile
subclass of: Class
  type: Restriction
  onDataRange: hexBinary
  onProperty: packageVerificationCodeValue
  qualifiedCardinality: 1
term status: stable

Has Format
type: Property
comment: A related resource that is substantially the same as the pre-existing described resource, but in another format.
subPropertyOf: Relation
date: 2008-01-14
date: 2000-07-11
description: This property is intended to be used with non-literal values. This property is an inverse property of Is Format Of.
Relation: hasFormat-003
Has Version: hasFormat-003
issued: 2000-07-11
Date Modified: 2008-01-14
note: This term is intended to be used with non-literal values as defined in the DCMI Abstract Model (http://dublincore.org/documents/abstract-model/). As of December 2007, the DCMI Usage Board is seeking a way to express this intention with a formal range declaration.

Extent
type: Property
comment: The size or duration of the resource.
range: Size or Duration
subPropertyOf: Format
range includes: Size or Duration
date: 2000-07-11
date: 2008-01-14
description: Recommended practice is to specify the file size in megabytes and duration in ISO 8601 format.
Relation: extent-003
Has Version: extent-003
issued: 2000-07-11
Date Modified: 2008-01-14

fileType video
type: Thing
type: NamedIndividual
type: FileType
comment: The file is associated with a video file type (MIME type of video/*).
term status: stable

Violation
type: Severity
comment: The severity for a violation validation result.

Date
type: Property
comment: A point or period of time associated with an event in the lifecycle of the resource.
date: 1999-07-02
description: Date may be used to express temporal information at any level of granularity. Recommended practice is to express the date, date/time, or period of time according to ISO 8601-1 [[ISO 8601-1](https://www.iso.org/iso-8601-date-and-time-format.html)] or a published profile of the ISO standard, such as the W3C Note on Date and Time Formats [[W3CDTF](https://www.w3.org/TR/NOTE-datetime)] or the Extended Date/Time Format Specification [[EDTF](http://www.loc.gov/standards/datetime/)]. If the full date is unknown, month and year (YYYY-MM) or just year (YYYY) may be used. Date ranges may be specified using ISO 8601 period of time specification in which start and end dates are separated by a '/' (slash) character. Either the start or end date may be missing.
issued: 1999-07-02
note: A [second property](/specifications/dublin-core/dcmi-terms/#http://purl.org/dc/terms/date) with the same name as this property has been declared in the [dcterms: namespace](http://purl.org/dc/terms/). See the Introduction to the document [DCMI Metadata Terms](/specifications/dublin-core/dcmi-terms/) for an explanation.

datatype
type: Property
comment: Specifies an RDF datatype that all value nodes must have.
range: Datatype

Annotation
type: Class
comment: The class of annotated annotations for which the RDF serialization consists of an annotated subject, predicate and object.
subclass of: Resource

Is Referenced By
type: Property
comment: A related resource that references, cites, or otherwise points to the described resource.
subPropertyOf: Relation
date: 2000-07-11
date: 2008-01-14
description: This property is intended to be used with non-literal values. This property is an inverse property of References.
Relation: isReferencedBy-003
Has Version: isReferencedBy-003
issued: 2000-07-11
Date Modified: 2008-01-14
note: This term is intended to be used with non-literal values as defined in the DCMI Abstract Model (http://dublincore.org/documents/abstract-model/). As of December 2007, the DCMI Usage Board is seeking a way to express this intention with a formal range declaration.

qualified min count
type: Property
comment: The minimum number of value nodes that must conform to the shape.

Serialization in Kaitai Struct for Java and Python
type: CompletedProject
type: Proposal
type: Project
proposal name: Serialization in Kaitai Struct for Java and Python
proposal status: Complete
proposal website: kaitai.io
to fund: BinaryAnalysisFund

RFC 4646
type: Datatype
type: Class
comment: The set of tags constructed according to RFC 4646 for the identification of languages.
date: 2008-01-14
description: RFC 4646 obsoletes RFC 3066.
Relation: RFC4646-001
Has Version: RFC4646-001
issued: 2008-01-14

DCnets
type: CompletedProject
type: Proposal
type: Project
proposal name: DCnets
proposal status: Complete
proposal website: dcnets.gforge.uni.lu
to fund: PET Fund

ResourceSelection
type: Class
comment: Instances of the ResourceSelection class identify part (described by an oa:Selector) of another resource (referenced with oa:hasSource), possibly from a particular representation of a resource (described by an oa:State). Please note that ResourceSelection is not used directly in the Web Annotation model, but is provided as a separate class for further application profiles to use, separate from oa:SpecificResource which has many Annotation specific features.

Guix-Daemon
type: RunningProject
type: Proposal
type: Project
proposal name: Guix-Daemon
proposal status: Running
proposal website: guix.gnu.org
to fund: Core Fund

relationshipType expandedFromArchive
type: RelationshipType
type: Thing
type: NamedIndividual
comment: A Relationship of relationshipType_expandedFromArchive expresses that the SPDXElement is a file which was epanded from a relatedSPDXElement file. For example, if there is an archive file xyz.tar.gz containing a file foo.c the archive file was expanded in a directory arch/xyz, the file arch/xyz/foo.c would have a relationshipType_expandedFromArchive with the file xyz.tar.gz.
term status: stable

relationshipType optionalComponentOf
type: RelationshipType
type: Thing
type: NamedIndividual
comment: To be used when SPDXRef-A is an optional component of SPDXRef-B.
term status: stable

dream2nix
type: RunningProject
type: Proposal
type: Project
proposal name: dream2nix
proposal status: Running
proposal website: dream2nix
to fund: Assure Fund

Private Searx
type: CompletedProject
type: Proposal
type: Project
proposal name: Private Searx
proposal status: Complete
proposal website: searx
to fund: Discovery Fund

less than or equals
type: Property
comment: Specifies a property that must have smaller or equal values than the value nodes.
range: Property

Makatea
type: RunningProject
type: Proposal
type: Project
proposal name: Makatea
proposal status: Running
proposal website: makatea
to fund: Entrust Fund

property validator
type: Property
comment: The validator(s) used to evaluate a constraint in the context of a property shape.
domain: Constraint component
range: Validator

canonical
type: Property
comment: A object of the relationship is the canonical IRI that can always be used to deduplicate the Annotation, regardless of the current IRI used to access the representation.

Pion
type: RunningProject
type: Proposal
type: Project
proposal name: Pion
proposal status: Running
proposal website: webrtc
to fund: UOI Fund

annotation variable name
type: Property
comment: The name of the SPARQL variable from the SELECT clause that shall be used for the values.
domain: Result annotation

Ontology
type: Class
comment: The class of ontologies.
subclass of: Resource

Great OCR for SANE
type: CompletedProject
type: Proposal
type: Project
proposal name: Great OCR for SANE
proposal status: Complete
proposal website: sane-project.org
to fund: Discovery Fund

bottomDataProperty
type: Property
type: DatatypeProperty
comment: The data property that does not relate any individual to any data value.
domain: Thing

Robotnix
type: CompletedProject
type: Proposal
type: Project
proposal name: Robotnix
proposal status: Complete
proposal website: robotnix
to fund: PET Fund

Open Web Calendar Stack
type: Proposal
type: Project
proposal name: Open Web Calendar Stack
proposal status: Selected
proposal website: open-web-calendar.hosted.quelltext.eu
to fund: Core Fund

nodes
type: Property
comment: The node expression producing the input nodes of a filter shape expression.

data access service
type: Property
type: ObjectProperty
comment: Et websted eller endpoint der giver adgang til en repræsentation af datasættet. @da
comment: Umístění či přístupový bod zpřístupňující distribuci datové sady. @cs
comment: Un sitio o end-point que da acceso a la distribución de un conjunto de datos. @es
comment: Un sito o end-point che dà accesso alla distribuzione del set di dati. @it
comment: A site or end-point that gives access to the distribution of the dataset.
label: servizio di accesso ai dati @it
label: dataadgangstjeneste @da
label: servicio de acceso de datos @es
label: služba pro přístup k datům @cs
range: Data service
change note: Nueva propiedad agregada en DCAT 2.0. @es
change note: Nuova proprietà aggiunta in DCAT 2.0. @it
change note: Ny egenskab tilføjet i DCAT 2.0. @da
change note: New property added in DCAT 2.0.
change note: Nová vlastnost přidaná ve verzi DCAT 2.0. @cs

Collabora Online/LibreOffice Accessibility
type: CompletedProject
type: Proposal
type: Project
proposal name: Collabora Online/LibreOffice Accessibility
proposal status: Complete
proposal website: collaboraonline.github.io
to fund: Entrust Fund

styledBy
type: Property
comment: A reference to a Stylesheet that should be used to apply styles to the Annotation rendering.
domain: Annotation
range: Style

Secure User Interfaces (Spritely)
type: Proposal
type: Project
proposal name: Secure User Interfaces (Spritely)
proposal status: Selected
proposal website: spritely
to fund: PET Fund

StreetComplete
type: CompletedProject
type: Proposal
type: Project
proposal name: StreetComplete
proposal status: Complete
proposal website: StreetComplete
to fund: Discovery Fund

Charon
type: RunningProject
type: Proposal
type: Project
proposal name: Charon
proposal status: Running
proposal website: charon
to fund: Entrust Fund

Yrs
type: Proposal
type: CompletedProject
type: Project
proposal name: Yrs
proposal status: Complete
proposal website: yjs
proposal website: y-crdt
to fund: Assure Fund

Spritely (and OCapN)
type: CompletedProject
type: Proposal
type: Project
proposal name: Spritely (and OCapN)
proposal status: Complete
proposal website: spritelyproject.org
to fund: Assure Fund

Improve Krill (RPKI) BGP integration
type: Proposal
type: Project
proposal name: Improve Krill (RPKI) BGP integration
proposal status: Selected
proposal website: stable
to fund: Entrust Fund

hasFile
type: ObjectProperty
type: Property
comment: Indicates that a particular file belongs to a package.
domain: Package
range: File
term status: stable

startIndex
type: FunctionalProperty
type: Property
type: DatatypeProperty
comment: In a strictly ordered logical collection, specifies the index position of the first item in the items list
domain: OrderedCollectionPage

variation graph (vgteam)
type: CompletedProject
type: Proposal
type: Project
proposal name: variation graph (vgteam)
proposal status: Complete
proposal website: vg
to fund: Discovery Fund

fileType spdx
type: Thing
type: NamedIndividual
type: FileType
comment: The file is an SPDX document.
term status: stable

service
type: ObjectProperty
type: Property
comment: Un sitio o 'endpoint' que está listado en el catálogo. @es
comment: Et websted eller et endpoint som er opført i kataloget. @da
comment: Un sito o endpoint elencato nel catalogo. @it
comment: A site or endpoint that is listed in the catalog.
comment: Umístění či přístupový bod registrovaný v katalogu. @cs
domain: Catalog
label: služba @cs
label: servizio @it
label: servicio @es
label: datatjeneste @da
range: Data service
subPropertyOf: member
subPropertyOf: Has Part
alternative label: har datatjeneste @da
change note: Nová vlastnost přidaná ve verzi DCAT 2.0. @cs
change note: New property added in DCAT 2.0.
change note: Nuova proprietà aggiunta in DCAT 2.0. @it
change note: Nueva propiedad añadida en DCAT 2.0. @es

deactivated
type: Property
comment: If set to true then all nodes conform to this.

Datatype constraint component
type: Parameterizable
type: Constraint component
comment: A constraint component that can be used to restrict the datatype of all value nodes.
parameter: DatatypeConstraintComponent-datatype

YaCy Grid SaaS
type: CompletedProject
type: Proposal
type: Project
proposal name: YaCy Grid SaaS
proposal status: Complete
proposal website: yacy.net
to fund: Discovery Fund

date
type: DatatypeProperty
type: Property
comment: A date-time stamp.
domain: Class
  unionOf: Annotation
  unionOf: CreationInfo
range: dateTime
term status: stable

relationshipType describedBy
type: RelationshipType
type: Thing
type: NamedIndividual
comment: Is to be used an SPDXRef-A is described by SPDXRef-Document.
term status: stable

FIDO 2.2
type: Proposal
type: Project
proposal name: FIDO 2.2
proposal status: Selected
proposal website: fido-authenticator
to fund: Assure Fund

complementOf
type: Property
comment: The property that determines that a given class is the complement of another class.
domain: Class
range: Class

Geolexica reverse
type: CompletedProject
type: Proposal
type: Project
proposal name: Geolexica reverse
proposal status: Complete
proposal website: www.geolexica.org
to fund: Discovery Fund

File
type: Class
comment: A File represents a named sequence of information that is contained in a software package.
subclass of: SpdxItem
subclass of: Class
  type: Restriction
  maxQualifiedCardinality: 1
  onDataRange: string
  onProperty: noticeText
subclass of: Class
  type: Restriction
  minQualifiedCardinality: 0
  onDataRange: string
  onProperty: fileContributor
subclass of: Class
  type: Restriction
  minQualifiedCardinality: 0
  onClass: FileType
  onProperty: fileType
subclass of: Class
  type: Restriction
  minQualifiedCardinality: 0
  onClass: AnyLicenseInfo
  onProperty: licenseInfoInFile
subclass of: Class
  type: Restriction
  minQualifiedCardinality: 0
  onClass: Project
  onProperty: artifactOf
subclass of: Class
  type: Restriction
  minQualifiedCardinality: 0
  onClass: File
  onProperty: fileDependency
subclass of: Class
  type: Restriction
  onDataRange: string
  onProperty: fileName
  qualifiedCardinality: 1
subclass of: Class
  type: Restriction
  minQualifiedCardinality: 1
  onClass: Checksum
  onProperty: checksum
disjointWith: Snippet
term status: stable

OrderedCollectionPage
type: Class
comment: An ordered subset of items from an OrderedCollection
subclass of: CollectionPage

last
type: FunctionalProperty
type: Property
type: ObjectProperty
comment: In a paged Collection, indicates the furthest proceeding page of the collection.
domain: Collection
range: Class
  unionOf: CollectionPage
  unionOf: Link

equivalentProperty
type: Property
comment: The property that determines that two given properties are equivalent.
domain: Property
range: Property

License
type: Property
comment: A legal document giving official permission to do something with the resource.
range: License Document
subPropertyOf: Rights
range includes: License Document
date: 2008-01-14
date: 2004-06-14
description: Recommended practice is to identify the license document with a URI. If this is not possible or feasible, a literal value that identifies the license may be provided.
Relation: license-002
Has Version: license-002
issued: 2004-06-14
Date Modified: 2008-01-14

SIP RELOAD
type: RunningProject
type: Proposal
type: Project
proposal name: SIP RELOAD
proposal status: Running
proposal website: reload
to fund: Entrust Fund

Block
type: Class
subclass of: Ignore

VPN Fund
fund label: VPN Fund
fund status: Open
proposals accepted: 11
proposals submitted: 23

relationshipType descendantOf
type: RelationshipType
type: Thing
type: NamedIndividual
comment: A Relationship of relationshipType_descendantOf expresses that an SPDXElement is a descendant of (same lineage but post-dates) the relatedSPDXElement. For example, an downstream File that was modified is a descendant of an upstream File
term status: stable

BlueTrace/OpenTrace
type: Proposal
type: Project
proposal name: BlueTrace/OpenTrace
proposal status: Selected
proposal website: bluetrace.io
to fund: SARS-CoV2 Fund

Kaidan Auth + portability
type: RunningProject
type: Proposal
type: Project
proposal name: Kaidan Auth + portability
proposal status: Running
proposal website: kaidan.im
to fund: Entrust Fund

Indigenous
type: CompletedProject
type: Proposal
type: Project
proposal name: Indigenous
proposal status: Complete
proposal website: indigenous-android
to fund: Discovery Fund

eduVPN mobile testing
type: Proposal
type: Project
proposal name: eduVPN mobile testing
proposal status: Selected
proposal website: eduvpn.org
to fund: VPN Fund

Taler for local currencies.
type: CompletedProject
type: Proposal
type: Project
proposal name: Taler for local currencies.
proposal status: Complete
proposal website: taler.net
to fund: Entrust Fund

Mastodon - groups, filtering, moderation
type: Proposal
type: Project
proposal name: Mastodon - groups, filtering, moderation
proposal status: Selected
proposal website: joinmastodon.org
to fund: Discovery Fund

Thing
type: Class
comment: The class of OWL individuals.

StreetComplete/AllThePlaces
type: Proposal
type: Project
proposal name: StreetComplete/AllThePlaces
proposal status: Selected
proposal website: streetcomplete.app
to fund: Entrust Fund

primaryPackagePurpose
type: ObjectProperty
type: Property
comment: This field provides information about the primary purpose of the identified package. Package Purpose is intrinsic to how the package is being used rather than the content of the package.
domain: Package
range: Purpose
term status: stable

InternetHardeningFund
fund label: Internet Hardening Fund
fund status: Open
proposals accepted: 26
proposals submitted: 68

SeedVault Integrity
type: RunningProject
type: Proposal
type: Project
proposal name: SeedVault Integrity
proposal status: Running
proposal website: wiki
to fund: Entrust Fund

Publisher
type: Property
comment: An entity responsible for making the resource available.
date: 1999-07-02
description: Examples of a Publisher include a person, an organization, or a service. Typically, the name of a Publisher should be used to indicate the entity.
issued: 1999-07-02
note: A [second property](/specifications/dublin-core/dcmi-terms/#http://purl.org/dc/terms/publisher) with the same name as this property has been declared in the [dcterms: namespace](http://purl.org/dc/terms/). See the Introduction to the document [DCMI Metadata Terms](/specifications/dublin-core/dcmi-terms/) for an explanation.

checksumAlgorithm adler32
type: ChecksumAlgorithm
type: Thing
type: NamedIndividual
comment: Indicates the algorithm used was ADLER32.
term status: stable

Solid Application Interoperability
type: CompletedProject
type: Proposal
type: Project
proposal name: Solid Application Interoperability
proposal status: Complete
proposal website: specification
to fund: Discovery Fund

GNU Taler wallet app for iOS
type: RunningProject
type: Proposal
type: Project
proposal name: GNU Taler wallet app for iOS
proposal status: Running
proposal website: wallet.html
to fund: Entrust Fund

MinLengthConstraintComponent-minLength
type: Shape
type: Property shape
type: Parameter
datatype: integer
max count: 1
path: min length

relationshipType copyOf
type: RelationshipType
type: Thing
type: NamedIndividual
comment: A Relationship of relationshipType_copyOf expresses that the SPDXElement is an exact copy of the relatedSDPXElement. For example, a downstream distribution of a binary library which was copied from the upstream package.
term status: stable

NREN
fund label: NREN
fund status: Open
proposals accepted: 4
proposals submitted: 81

annotationService
type: Property
comment: The object of the relationship is the end point of a service that conforms to the annotation-protocol, and it may be associated with any resource. The expectation of asserting the relationship is that the object is the preferred service for maintaining annotations about the subject resource, according to the publisher of the relationship. This relationship is intended to be used both within Linked Data descriptions and as the rel type of a Link, via HTTP Link Headers rfc5988 for binary resources and in HTML elements. For more information about these, please see the Annotation Protocol specification annotation-protocol.

GetEduroam Fund
fund label: GetEduroam
fund status: Open
proposals accepted: 1
proposals submitted: 1

Language
type: Property
comment: A language of the resource.
range: Linguistic System
subPropertyOf: Language
range includes: Linguistic System
date: 2008-01-14
description: Recommended best practice is to use a controlled vocabulary such as RFC 4646 [RFC4646].
description: Recommended practice is to use either a non-literal value representing a language from a controlled vocabulary such as ISO 639-2 or ISO 639-3, or a literal value consisting of an IETF Best Current Practice 47 [[IETF-BCP47](https://tools.ietf.org/html/bcp47)] language tag.
Relation: languageT-001
Has Version: languageT-001
issued: 2008-01-14
Date Modified: 2008-01-14

Pythonic Slint
type: RunningProject
type: Proposal
type: Project
proposal name: Pythonic Slint
proposal status: Running
proposal website: slint
to fund: Entrust Fund

Bibliographic Citation
type: Property
comment: A bibliographic reference for the resource.
domain: Bibliographic Resource
subPropertyOf: Identifier
date: 2003-02-15
date: 2008-01-14
description: Recommended practice is to include sufficient bibliographic detail to identify the resource as unambiguously as possible.
Relation: bibliographicCitation-002
Has Version: bibliographicCitation-002
issued: 2003-02-15
Date Modified: 2008-01-14

licenseExceptionId
type: DatatypeProperty
type: Property
comment: Short form license exception identifier in Appendix I.2 of the SPDX specification.
domain: LicenseException
term status: stable

Style
type: Class
comment: A Style describes the intended styling of a resource as applied to the particular Annotation, and thus provides the information to ensure that rendering is consistent across implementations.

Sonar: a modular peer-to-peer search engine
type: Proposal
type: Project
proposal name: Sonar: a modular peer-to-peer search engine
proposal status: Selected
proposal website: arso.xyz
to fund: Discovery Fund

prefix
type: Property
comment: The object of the property is a snippet of content that occurs immediately before the content which is being selected by the Selector.

Literal
type: Node kind
comment: The node kind of all literals.

relationshipType other
type: RelationshipType
type: Thing
type: NamedIndividual
comment: to be used for a relationship which has not been defined in the formal SPDX specification. A description of the relationship should be included in the Relationship comments field.
term status: stable

Activity Streams 2.0
type: Ontology
comment: Experimental Activity Streams 2.0 Ontology
description: Experimental and unoffical ontology for Activity Streams 2.0 and ActivityPub. This was created for experimentation by Steve Bate and based on the original incomplete AS ontology.

WPIA CA Infrastructure
type: CompletedProject
type: Proposal
type: Project
proposal name: WPIA CA Infrastructure
proposal status: Complete
proposal website: wpia.club
to fund: InternetHardeningFund

Replicant on Pinephone 1.2
type: RunningProject
type: Proposal
type: Project
proposal name: Replicant on Pinephone 1.2
proposal status: Running
proposal website: AddSupportForThePinephone
to fund: Entrust Fund

checksumAlgorithm md4
type: ChecksumAlgorithm
type: Thing
type: NamedIndividual
comment: Indicates the algorithm used was MD4
term status: stable

Bitmask
type: CompletedProject
type: Proposal
type: Project
proposal name: Bitmask
proposal status: Complete
proposal website: bitmask.net
to fund: PET Fund

UEFI Capsule Update for coreboot with EDK II
type: Proposal
type: Project
proposal name: UEFI Capsule Update for coreboot with EDK II
proposal status: Selected
proposal website: capsule-updates
to fund: Entrust Fund

SCION-RAINS
type: CompletedProject
type: Proposal
type: Project
proposal name: SCION-RAINS
proposal status: Complete
proposal website: www.netsys.ovgu.de
to fund: Discovery Fund

TISG trustable image sensor gateware
type: RunningProject
type: Proposal
type: Project
proposal name: TISG trustable image sensor gateware
proposal status: Running
proposal website: StereoNinjaFPGA
to fund: Entrust Fund

PyCM
type: CompletedProject
type: Proposal
type: Project
proposal name: PyCM
proposal status: Complete
proposal website: pycm
to fund: Assure Fund

LCSH
type: VocabularyEncodingScheme
comment: The set of labeled concepts specified by the Library of Congress Subject Headings.
date: 2000-07-11
date: 2008-01-14
Relation: LCSH-003
Has Version: LCSH-003
issued: 2000-07-11
Date Modified: 2008-01-14

Pitchfork PKCS#11
type: CompletedProject
type: Proposal
type: Project
proposal name: Pitchfork PKCS#11
proposal status: Complete
proposal website: pitchfork.ist
to fund: InternetHardeningFund

Nominatim
type: CompletedProject
type: Proposal
type: Project
proposal name: Nominatim
proposal status: Complete
proposal website: nominatim.org
to fund: Discovery Fund

exact
type: Property
comment: The object of the predicate is a copy of the text which is being selected, after normalization.

Move
type: Class
comment: The actor is moving the object. The target specifies where the object is moving to. The origin specifies where the object is moving from.
subclass of: Activity

Bana
type: RunningProject
type: Proposal
type: Project
proposal name: Bana
proposal status: Running
proposal website: restoration.software
to fund: Entrust Fund

editing
type: Concept
type: Motivation
comment: The motivation for when the user intends to request a change or edit to the Target resource.

Spectrum
type: CompletedProject
type: Proposal
type: Project
proposal name: Spectrum
proposal status: Complete
proposal website: spectrum-os.org
to fund: PET Fund

endTime
type: FunctionalProperty
type: Property
type: DatatypeProperty
comment: The ending time of the object
domain: Object
range: dateTime

Tombstone
type: Class
comment: A placeholder for a deleted object
subclass of: Object

Autocrypt for Thunderbird
type: CompletedProject
type: Proposal
type: Project
proposal name: Autocrypt for Thunderbird
proposal status: Complete
proposal website: autocrypt.org
to fund: PET Fund

Alive2
type: Proposal
type: Project
proposal name: Alive2
proposal status: Selected
proposal website: alive2
to fund: Core Fund

GNU Taler
type: CompletedProject
type: Proposal
type: Project
proposal name: GNU Taler
proposal status: Complete
proposal website: taler.net
to fund: PET Fund

SimpleSAMLphp
type: RunningProject
type: Proposal
type: Project
proposal name: SimpleSAMLphp
proposal status: Running
proposal website: simplesamlphp.org
to fund: SimpleSAMLphp Fund

Alt
type: Class
comment: The class of containers of alternatives.
subclass of: Container

Forgejo
type: RunningProject
type: Proposal
type: Project
proposal name: Forgejo
proposal status: Running
proposal website: forgejo
to fund: Entrust Fund

externalRef
type: ObjectProperty
type: Property
comment: An External Reference allows a Package to reference an external source of additional information, metadata, enumerations, asset identifiers, or downloadable content believed to be relevant to the Package.
domain: Package
range: ExternalRef
term status: stable

Implement sound support in the Hurd
type: CompletedProject
type: Proposal
type: Project
proposal name: Implement sound support in the Hurd
proposal status: Complete
proposal website: hurd.gnu.org
to fund: PET Fund

HTML
type: Class
type: Datatype
comment: The datatype of RDF literals storing fragments of HTML content
subclass of: Literal

Marios Meimaris
type: Agent

TentativeAccept
type: Class
comment: Actor tentatively accepts the Object
subclass of: Accept

Servo
type: RunningProject
type: Proposal
type: Project
proposal name: Servo
proposal status: Running
proposal website: servo.org
to fund: Entrust Fund

members
type: Property
comment: The property that determines the collection of members in either a owl:AllDifferent, owl:AllDisjointClasses or owl:AllDisjointProperties axiom.
domain: Resource
range: List

Cryptech
fund label: Cryptech Fund
fund status: Open
proposals accepted: 5
proposals submitted: 5

Period of Time
type: Class
comment: An interval of time that is named or defined by its start and end dates.
subclass of: Location, Period, or Jurisdiction
date: 2008-01-14
Relation: PeriodOfTime-001
Has Version: PeriodOfTime-001
issued: 2008-01-14

WithExceptionOperator
type: Class
comment: Sometimes a set of license terms apply except under special circumstances. In this case, use the binary "WITH" operator to construct a new license expression to represent the special exception situation. A valid <license-expression> is where the left operand is a <simple-expression> value and the right operand is a <license-exception-id> that represents the special exception terms.
subclass of: AnyLicenseInfo
subclass of: Class
  type: Restriction
  onClass: LicenseException
  onProperty: licenseException
  qualifiedCardinality: 1
subclass of: Class
  type: Restriction
  onClass: SimpleLicensingInfo
  onProperty: member
  qualifiedCardinality: 1
term status: stable

next
type: FunctionalProperty
type: Property
type: ObjectProperty
comment: In a paged Collection, indicates the next page of items.
domain: CollectionPage
range: Class
  unionOf: CollectionPage
  unionOf: Link

relationshipType optionalDependencyOf
type: RelationshipType
type: Thing
type: NamedIndividual
comment: Is to be used when SPDXRef-A is an optional dependency of SPDXRef-B.
term status: stable

Standard
type: Class
comment: A basis for comparison; a reference point against which other things can be evaluated.
comment: A reference point against which other things can be evaluated or compared.
date: 2008-01-14
Relation: Standard-001
Has Version: Standard-001
issued: 2008-01-14

bookmarking
type: Concept
type: Motivation
comment: The motivation for when the user intends to create a bookmark to the Target or part thereof.

orderedItems
type: ObjectProperty
type: Property
comment: Identifies the items contained in a collection. The items are ordered. Only show in examples in the AS2 spec.
domain: OrderedCollection
range: Class
  unionOf: Class
    unionOf: Object
    unionOf: Link
  unionOf: OrderedItems

serves dataset
type: Property
type: ObjectProperty
comment: A collection of data that this DataService can distribute.
comment: Kolekce dat, kterou je tato Datová služba schopna poskytnout. @cs
comment: Una raccolta di dati che questo DataService può distribuire. @it
comment: En samling af data som denne datatjeneste kan distribuere. @da
comment: Una colección de datos que este Servicio de Datos puede distribuir. @es
domain: Data service
label: provee conjunto de datos @es
label: poskytuje datovou sadu @cs
label: serve set di dati @it
label: datatjeneste for datasæt @da
range: Dataset
alternative label: distribuerer @da
alternative label: ekspederer @da
alternative label: udstiller @da
change note: Nueva propiedad agregada en DCAT 2.0. @es
change note: Nuova proprietà in DCAT 2.0. @it
change note: Nová vlastnost přidaná ve verzi DCAT 2.0. @cs
change note: New property in DCAT 2.0.

Policy
type: Class
comment: A plan or course of action by an authority, intended to influence and determine decisions, actions, and other matters.
date: 2008-01-14
Relation: Policy-001
Has Version: Policy-001
issued: 2008-01-14

OrLaterOperator
type: Class
comment: A license with an or later operator indicating this license version or any later version of the license
subclass of: AnyLicenseInfo
subclass of: Class
  type: Restriction
  onClass: SimpleLicensingInfo
  onProperty: member
  qualifiedCardinality: 1
term status: stable

Pimalaya
type: RunningProject
type: Proposal
type: Project
proposal name: Pimalaya
proposal status: Running
proposal website: pimalaya.org
to fund: Entrust Fund

subject
type: Property
comment: An expression producing the resources that shall be inferred as subjects.
domain: A rule based on triple (subject, predicate, object) pattern.

ByteOffsetPointer
type: Class
subclass of: OffsetPointer
subclass of: Class
  type: Restriction
  onDataRange: positiveInteger
  onProperty: offset
  qualifiedCardinality: 1
term status: stable

Finish porting Replicant to newer Android version
type: Proposal
type: Project
proposal name: Finish porting Replicant to newer Android version
proposal status: Selected
proposal website: Porting Replicant to Android 9
to fund: PET Fund

Castopod Mobile
type: CompletedProject
type: Proposal
type: Project
proposal name: Castopod Mobile
proposal status: Complete
proposal website: podlibre.org
to fund: Discovery Fund

GNU Mes RISC-V
type: CompletedProject
type: Proposal
type: Project
proposal name: GNU Mes RISC-V
proposal status: Complete
proposal website: mes
to fund: Assure Fund

copyrightText
type: Property
type: DatatypeProperty
comment: The text of copyright declarations recited in the package, file or snippet. If the copyrightText field is not present, it implies an equivalent meaning to NOASSERTION.
domain: SpdxItem
term status: stable

licenseListVersion
type: FunctionalProperty
type: DatatypeProperty
type: Property
comment: An optional field for creators of the SPDX file to provide the version of the SPDX License List used when the SPDX file was created.
domain: CreationInfo
term status: stable

Cryptech
type: Proposal
type: Project
proposal name: Cryptech
proposal status: Selected
proposal website: cryptech.is
to fund: Cryptech

FileSender UX/UI
type: RunningProject
type: Proposal
type: Project
proposal name: FileSender UX/UI
proposal status: Running
proposal website: filesender.org
to fund: FileSender

CollectionPage
type: Class
comment: A subset of items from a Collection
subclass of: Collection

LibreQoS
type: RunningProject
type: Proposal
type: Project
proposal name: LibreQoS
proposal status: Running
proposal website: libreqos.io
to fund: Entrust Fund

artifactOf
type: ObjectProperty
type: Property
comment: Indicates the project in which the SpdxElement originated. Tools must preserve doap:homepage and doap:name properties and the URI (if one is known) of doap:Project resources that are values of this property. All other properties of doap:Projects are not directly supported by SPDX and may be dropped when translating to or from some SPDX formats.
comment: Deprecated as of version 2.1
domain: SpdxElement
range: Project
deprecated: true
term status: deprecated

Blank node or IRI
type: Node kind
comment: The node kind of all blank nodes or IRIs.

CssStyle
type: Class
comment: A resource which describes styles for resources participating in the Annotation using CSS.
subclass of: Style

icon
type: Property
type: ObjectProperty
comment: Indicates an entity that describes an icon for this object. The image should have an aspect ratio of one (horizontal) to one (vertical) and should be suitable for presentation at a small size.
domain: Object
range: Class
  unionOf: Image
  unionOf: Link

Certbot ECDSA support
type: Proposal
type: Project
proposal name: Certbot ECDSA support
proposal status: Selected
proposal website: certbot.eff.org
to fund: InternetHardeningFund

ReferenceType
type: Class
comment: Types used to external reference identifiers.
subclass of: Class
  type: Restriction
  onDataRange: anyURI
  onProperty: externalReferenceSite
  qualifiedCardinality: 1
subclass of: Class
  type: Restriction
  onDataRange: anyURI
  onProperty: documentation
  qualifiedCardinality: 1
subclass of: Class
  type: Restriction
  onDataRange: anyURI
  onProperty: contextualExample
  qualifiedCardinality: 1
term status: stable

Sustainable web apps with m-ld
type: RunningProject
type: Proposal
type: Project
proposal name: Sustainable web apps with m-ld
proposal status: Running
proposal website: m-ld.org
to fund: Assure Fund

SPARQL SELECT validator
type: Class
comment: The class of validators based on SPARQL SELECT queries. The queries are evaluated for each focus node and are supposed to produce bindings for all focus nodes that do not conform.
subclass of: Validator
subclass of: SPARQL SELECT executable

Redwax
type: CompletedProject
type: Proposal
type: Project
proposal name: Redwax
proposal status: Complete
proposal website: redwax.eu
to fund: PET Fund

incompatibleWith
type: Property
type: OntologyProperty
type: AnnotationProperty
comment: The annotation property that indicates that a given ontology is incompatible with another ontology.
domain: Ontology
range: Ontology

Replaces
type: Property
comment: A related resource that is supplanted, displaced, or superseded by the described resource.
subPropertyOf: Relation
date: 2000-07-11
date: 2008-01-14
description: This property is intended to be used with non-literal values. This property is an inverse property of Is Replaced By.
Relation: replaces-003
Has Version: replaces-003
issued: 2000-07-11
Date Modified: 2008-01-14
note: This term is intended to be used with non-literal values as defined in the DCMI Abstract Model (http://dublincore.org/documents/abstract-model/). As of December 2007, the DCMI Usage Board is seeking a way to express this intention with a formal range declaration.

Qualified-min-count constraint component
type: Constraint component
type: Parameterizable
comment: A constraint component that can be used to verify that a specified minimum number of value nodes conforms to a given shape.
parameter: QualifiedMinCountConstraintComponent-qualifiedMinCount
parameter: QualifiedMinCountConstraintComponent-qualifiedValueShapesDisjoint
parameter: QualifiedMinCountConstraintComponent-qualifiedValueShape

primaryTopic
type: Property
type: ObjectProperty
comment: This axiom needed so that Protege loads DCAT2 without errors.

Earthstar
type: CompletedProject
type: Proposal
type: Project
proposal name: Earthstar
proposal status: Complete
proposal website: earthstar
to fund: Assure Fund

Noise Explorer-VerifPal
type: CompletedProject
type: Proposal
type: Project
proposal name: Noise Explorer-VerifPal
proposal status: Complete
proposal website: noiseexplorer.com
to fund: PET Fund

purpose other
type: Purpose
type: Thing
type: NamedIndividual
comment: The package doesn't fit into other purpose defined terms.
term status: stable

ReflexiveProperty
type: Class
comment: The class of reflexive properties.
subclass of: ObjectProperty

qualified value shapes disjoint
type: Property
comment: Can be used to mark the qualified value shape to be disjoint with its sibling shapes.

ExternalDocumentRef
type: Class
comment: Information about an external SPDX document reference including the checksum. This allows for verification of the external references.
subclass of: Class
  type: Restriction
  onClass: SpdxDocument
  onProperty: spdxDocument
  qualifiedCardinality: 1
subclass of: Class
  type: Restriction
  onClass: Checksum
  onProperty: checksum
  qualifiedCardinality: 1
subclass of: Class
  type: Restriction
  onDataRange: anyURI
  onProperty: externalDocumentId
  qualifiedCardinality: 1
term status: stable

Parameterizable
type: Class
comment: Superclass of components that can take parameters, especially functions and constraint components.
subclass of: Resource

url
type: Property
type: ObjectProperty
comment: Specifies a link to a specific representation of the Object
domain: Object
range: Class
  unionOf: Link
  unionOf: Thing

RFC 5646
type: Class
type: Datatype
comment: The set of tags constructed according to RFC 5646 for the identification of languages.
date: 2010-10-11
description: RFC 5646 obsoletes RFC 4646.
Relation: RFC5646-001
Has Version: RFC5646-001
issued: 2010-10-11

specVersion
type: Property
type: DatatypeProperty
comment: Provide a reference number that can be used to understand how to parse and interpret the rest of the file. It will enable both future changes to the specification and to support backward compatibility. The version number consists of a major and minor version indicator. The major field will be incremented when incompatible changes between versions are made (one or more sections are created, modified or deleted). The minor field will be incremented when backwards compatible changes are made.
domain: SpdxDocument

imap-codec library
type: Project
type: RunningProject
type: Proposal
proposal name: imap-codec library
proposal status: Running
proposal website: type-driven-development
proposal website: imap-codec
to fund: Assure Fund

purpose framework
type: Purpose
type: Thing
type: NamedIndividual
comment: The package is a software framework.
term status: stable

Subliminal Messaging
type: RunningProject
type: Proposal
type: Project
proposal name: Subliminal Messaging
proposal status: Running
proposal website: subliminal
to fund: Assure Fund

comment
type: DatatypeProperty
type: AnnotationProperty
type: Property
comment: A description of the subject resource.
domain: Resource

Property shape
type: Class
comment: A property shape is a shape that specifies constraints on the values of a focus node for a given property or path.
subclass of: Shape

units
type: FunctionalProperty
type: Property
type: DatatypeProperty
comment: Identifies the unit of measurement used by the radius, altitude and accuracy properties. The value can be expressed either as one of a set of predefined units or as a well-known common URI that identifies units.
domain: Place
range: Class
  type: Datatype
  unionOf: Class
    type: Datatype
    oneOf: inches
    oneOf: feet
    oneOf: miles
    oneOf: cm
    oneOf: m
    oneOf: km
  unionOf: anyURI

FairSync
type: CompletedProject
type: Proposal
type: Project
proposal name: FairSync
proposal status: Complete
proposal website: fairsync
to fund: Discovery Fund

Solid Data Modules
type: RunningProject
type: Proposal
type: Project
proposal name: Solid Data Modules
proposal status: Running
proposal website: solidproject.org
to fund: Entrust Fund

Libre-SOC
type: Proposal
type: Project
proposal name: Libre-SOC
proposal status: Selected
proposal website: nlnet 2018
to fund: PET Fund

Python bindings to the rattler library
type: RunningProject
type: Proposal
type: Project
proposal name: Python bindings to the rattler library
proposal status: Running
proposal website: rattler
to fund: Entrust Fund

Keyoxide
type: CompletedProject
type: Proposal
type: Project
proposal name: Keyoxide
proposal status: Complete
proposal website: keyoxide.org
to fund: Discovery Fund

Wolvic
type: RunningProject
type: Proposal
type: Project
proposal name: Wolvic
proposal status: Running
proposal website: wolvic.com
to fund: Entrust Fund

Annotation
type: Class
comment: The class for Web Annotations.

priorVersion
type: Property
type: AnnotationProperty
type: OntologyProperty
comment: The annotation property that indicates the predecessor ontology of a given ontology.
domain: Ontology
range: Ontology

The OWL 2 Schema vocabulary (OWL 2)
type: Ontology
comment: This ontology partially describes the built-in classes and properties that together form the basis of the RDF/XML syntax of OWL 2. The content of this ontology is based on Tables 6.1 and 6.2 in Section 6.4 of the OWL 2 RDF-Based Semantics specification, available at http://www.w3.org/TR/owl2-rdf-based-semantics/. Please note that those tables do not include the different annotations (labels, comments and rdfs:isDefinedBy links) used in this file. Also note that the descriptions provided in this ontology do not provide a complete and correct formal description of either the syntax or the semantics of the introduced terms (please see the OWL 2 recommendations for the complete and normative specifications). Furthermore, the information provided by this ontology may be misleading if not used with care. This ontology SHOULD NOT be imported into OWL ontologies. Importing this file into an OWL 2 DL ontology will cause it to become an OWL 2 Full ontology and may have other, unexpected, consequences.
imports: rdf-schema
versionInfo: $Date: 2009/11/15 10:54:12 $
namespace transformation: owx2rdf.xsl

QualifiedMinCountConstraintComponent-qualifiedValueShapesDisjoint
type: Shape
type: Property shape
type: Parameter
datatype: boolean
optional: true
path: qualified value shapes disjoint

FileType
type: Class
comment: Type of file.
term status: stable

AnnounceCollection
type: Class
comment: A collection of Actors.
subclass of: Collection
subclass of: Class
  type: Restriction
  onProperty: items
  someValuesFrom: Announce

message
type: Property
comment: A human-readable message (possibly with placeholders for variables) explaining the cause of the result.

Poliscoops
type: Proposal
type: Project
proposal name: Poliscoops
proposal status: Selected
proposal website: poliscoops.eu
to fund: Discovery Fund

in
type: Property
comment: Specifies a list of allowed values so that each value node must be among the members of the given list.
range: List

GNUnet Messenger API
type: RunningProject
type: Proposal
type: Project
proposal name: GNUnet Messenger API
proposal status: Running
proposal website: Using-the-GNUnet-Messenger
to fund: Assure Fund

Fast RSA + PQ Blind Signatures
type: Proposal
type: Project
proposal name: Fast RSA + PQ Blind Signatures
proposal status: Selected
proposal website: kirschju.re
to fund: Entrust Fund

someValuesFrom
type: Property
comment: The property that determines the class that an existential property restriction refers to.
domain: Restriction
range: Class

List
type: Class
comment: The class of RDF Lists.
subclass of: Resource

contextualExample
type: DatatypeProperty
type: Property
comment: Example for use of the external repository identifier
domain: ReferenceType
term status: stable

Inventaire recommender
type: CompletedProject
type: Proposal
type: Project
proposal name: Inventaire recommender
proposal status: Complete
proposal website: inventaire.io
to fund: Discovery Fund

JavaScript constraint component
type: Parameterizable
type: Constraint component
comment: A constraint component with the parameter sh:js linking to a sh:JSConstraint containing a sh:script.
parameter: JSConstraint-js

David Browning
type: Agent
affiliation: Refinitiv

Warning
type: Severity
comment: The severity for a warning validation result.

Nyxt
type: CompletedProject
type: Proposal
type: Project
proposal name: Nyxt
proposal status: Complete
proposal website: nyxt.atlas.engineer
to fund: Discovery Fund

Anchorboot
type: RunningProject
type: Proposal
type: Project
proposal name: Anchorboot
proposal status: Running
proposal website: wiki
to fund: Entrust Fund

JavaScript library
type: Class
comment: Represents a JavaScript library, typically identified by one or more URLs of files to include.
subclass of: Resource

Offer
type: Class
comment: To Offer something to someone or something
subclass of: Activity

Nyxt Webextensions
type: Proposal
type: Project
proposal name: Nyxt Webextensions
proposal status: Selected
proposal website: nyxt.atlas.engineer
to fund: Entrust Fund

unionOf
type: Property
comment: The property that determines the collection of classes or data ranges that build a union.
domain: Class
range: List

relationshipType runtimeDependencyOf
type: RelationshipType
type: Thing
type: NamedIndividual
comment: Is to be used when SPDXRef-A is a dependency required for the execution of SPDXRef-B.
term status: stable

Omnom
type: CompletedProject
type: Proposal
type: Project
proposal name: Omnom
proposal status: Complete
proposal website: omnom
to fund: Discovery Fund

Connect by Name
type: CompletedProject
type: Proposal
type: Project
proposal name: Connect by Name
proposal status: Complete
proposal website: getdnsapi.net
to fund: Discovery Fund

description
type: Property
comment: Human-readable descriptions for the property in the context of the surrounding shape.
domain: Property shape

Tasteweb
type: Proposal
type: Project
proposal name: Tasteweb
proposal status: Selected
proposal website: better space with wots.html
to fund: Entrust Fund

Usability of Linux firewall userspace tools
type: Proposal
type: Project
proposal name: Usability of Linux firewall userspace tools
proposal status: Selected
proposal website: www.netfilter.org
to fund: PET Fund

Language
type: Property
comment: A language of the resource.
date: 1999-07-02
description: Recommended practice is to use either a non-literal value representing a language from a controlled vocabulary such as ISO 639-2 or ISO 639-3, or a literal value consisting of an IETF Best Current Practice 47 [[IETF-BCP47](https://tools.ietf.org/html/bcp47)] language tag.
issued: 1999-07-02
note: A [second property](/specifications/dublin-core/dcmi-terms/#http://purl.org/dc/terms/language) with the same name as this property has been declared in the [dcterms: namespace](http://purl.org/dc/terms/). See the Introduction to the document [DCMI Metadata Terms](/specifications/dublin-core/dcmi-terms/) for an explanation.

WordPress ActivityPub
type: CompletedProject
type: Proposal
type: Project
proposal name: WordPress ActivityPub
proposal status: Complete
proposal website: mediaformat.org
to fund: Discovery Fund

File Format
type: Class
comment: A digital resource format.
subclass of: Media Type
date: 2008-01-14
description: Examples include the formats defined by the list of Internet Media Types.
Relation: FileFormat-001
Has Version: FileFormat-001
issued: 2008-01-14

zero or more path
type: Property
comment: The (single) value of this property represents a path that is matched zero or more times.

streams
type: Property
type: ObjectProperty
comment: A list of supplementary Collections which may be of interest.
domain: Object
range: Collection

TimeState
type: Class
comment: A TimeState records the time at which the resource's state is appropriate for the Annotation, typically the time that the Annotation was created and/or a link to a persistent copy of the current version.
subclass of: State

builtDate
type: DatatypeProperty
type: Property
comment: This field provides a place for recording the actual date the package was built.
domain: Package
range: dateTime
subPropertyOf: date
term status: stable

sourceDateStart
type: Property
comment: The start timestamp of the interval over which the Source resource should be interpreted as being applicable to the Annotation.
domain: TimeState
range: dateTime

MaxCountConstraintComponent-maxCount
type: Shape
type: Property shape
type: Parameter
datatype: integer
max count: 1
path: max count

update
type: Property
comment: The SPARQL UPDATE to execute.
domain: SPARQL UPDATE executable

Ripple
type: CompletedProject
type: Proposal
type: Project
proposal name: Ripple
proposal status: Complete
proposal website: ripple.unfathomable.blue
to fund: PET Fund

JavaScript executable
type: Class
comment: Abstract base class of resources that declare an executable JavaScript.
subclass of: Resource

Statement
type: Class
comment: The class of RDF statements.
subclass of: Resource

target
type: Property
comment: Links a shape to a target specified by an extension language, for example instances of sh:SPARQLTarget.
domain: Shape
range: Target

Exter
type: Proposal
type: Project
proposal name: Exter
proposal status: Selected
proposal website: exter
to fund: Core Fund

Bonfire federated groups
type: RunningProject
type: Proposal
type: Project
proposal name: Bonfire federated groups
proposal status: Running
proposal website: bonfirenetworks.org
to fund: Entrust Fund

Conversations
type: CompletedProject
type: Proposal
type: Project
proposal name: Conversations
proposal status: Complete
proposal website: conversations.im
to fund: PET Fund

TerosHDL
type: RunningProject
type: Proposal
type: Project
proposal name: TerosHDL
proposal status: Running
proposal website: terostechnology.github.io
to fund: Assure Fund

Person
type: Class
comment: A Person
subclass of: Object

libspng APNG
type: Proposal
type: Project
proposal name: libspng APNG
proposal status: Selected
proposal website: libspng.org
to fund: Entrust Fund

SpdxItem
type: Class
comment: An SpdxItem is a potentially copyrightable work.
subclass of: SpdxElement
subclass of: Class
  unionOf: Class
    type: Restriction
    hasValue: noassertion
    onProperty: licenseConcluded
  unionOf: Class
    type: Restriction
    hasValue: none
    onProperty: licenseConcluded
  unionOf: Class
    type: Restriction
    maxQualifiedCardinality: 1
    onClass: AnyLicenseInfo
    onProperty: licenseConcluded
subclass of: Class
  type: Restriction
  minQualifiedCardinality: 0
  onClass: AnyLicenseInfo
  onProperty: licenseInfoFromFiles
subclass of: Class
  type: Restriction
  maxQualifiedCardinality: 1
  onDataRange: string
  onProperty: copyrightText
subclass of: Class
  type: Restriction
  maxQualifiedCardinality: 1
  onDataRange: string
  onProperty: licenseComments
subclass of: Class
  type: Restriction
  minQualifiedCardinality: 0
  onDataRange: string
  onProperty: attributionText
term status: stable

Type
type: Property
comment: The nature or genre of the resource.
date: 1999-07-02
description: Recommended practice is to use a controlled vocabulary such as the DCMI Type Vocabulary [[DCMI-TYPE](http://dublincore.org/documents/dcmi-type-vocabulary/)]. To describe the file format, physical medium, or dimensions of the resource, use the Format element.
issued: 1999-07-02
note: A [second property](/specifications/dublin-core/dcmi-terms/#http://purl.org/dc/terms/type) with the same name as this property has been declared in the [dcterms: namespace](http://purl.org/dc/terms/). See the Introduction to the document [DCMI Metadata Terms](/specifications/dublin-core/dcmi-terms/) for an explanation.

OrderedActorCollection
type: Class
comment: A collection of Actors.
subclass of: OrderedCollection
subclass of: Class
  type: Restriction
  onProperty: orderedItems
  someValuesFrom: Actor

ULX3M
type: Proposal
type: Project
proposal name: ULX3M
proposal status: Selected
proposal website: radiona.org
to fund: PET Fund

GoToSocial
type: RunningProject
type: Proposal
type: Project
proposal name: GoToSocial
proposal status: Running
proposal website: docs.gotosocial.org
to fund: Entrust Fund

endpoints
type: Property
type: ObjectProperty
comment: A mapping of (typically server/domain-wide) endpoints which may be useful either for this actor or someone referencing this actor. This mapping may be nested inside the actor document as the value or may be a link to a JSON-LD document with these properties.
domain: Actor
range: Object

WikiRate Insights
type: CompletedProject
type: Proposal
type: Project
proposal name: WikiRate Insights
proposal status: Complete
proposal website: wikirate.org
to fund: Discovery Fund

standardLicenseTemplate
type: DatatypeProperty
type: Property
comment: License template which describes sections of the license which can be varied. See License Template section of the specification for format information.
domain: License
term status: stable

spdxDocument
type: ObjectProperty
type: Property
comment: A property containing an SPDX document.
domain: ExternalDocumentRef
range: SpdxDocument
term status: stable

Debug Adapter with Nix
type: Proposal
type: Project
proposal name: Debug Adapter with Nix
proposal status: Selected
proposal website: nda
to fund: Entrust Fund

postmarketOS Infra
type: CompletedProject
type: Proposal
type: Project
proposal name: postmarketOS Infra
proposal status: Complete
proposal website: postmarketos.org
to fund: postmarketOS Fund

prev
type: FunctionalProperty
type: Property
type: ObjectProperty
comment: In a paged Collection, identifies the previous page of items.
domain: CollectionPage
range: Class
  unionOf: CollectionPage
  unionOf: Link

Irdest spec, db, route scoring
type: RunningProject
type: Proposal
type: Project
proposal name: Irdest spec, db, route scoring
proposal status: Running
proposal website: irde.st
to fund: Entrust Fund

WebXray Discovery
type: CompletedProject
type: Proposal
type: Project
proposal name: WebXray Discovery
proposal status: Complete
proposal website: webXray Domain Owner List
to fund: Discovery Fund

Libre-SOC Video Acceleration
type: Proposal
type: Project
proposal name: Libre-SOC Video Acceleration
proposal status: Selected
proposal website: nlnet 2019 video
to fund: PET Fund

processingLanguage
type: Property
comment: The object of the property is the language that should be used for textual processing algorithms when dealing with the content of the resource, including hyphenation, line breaking, which font to use for rendering and so forth. The value must follow the recommendations of BCP47.

SPARQL target type
type: Class
comment: The (meta) class for parameterizable targets that are based on SPARQL queries.
subclass of: SPARQL SELECT executable
subclass of: Target type
subclass of: SPARQL ASK executable

ListedLicenseException
type: Class
comment: License exception specific to ListedLicenses
subclass of: LicenseException
subclass of: Class
  type: Restriction
  maxQualifiedCardinality: 1
  onDataRange: string
  onProperty: exceptionTextHtml

JavaScript-based constraint
type: Class
comment: The class of constraints backed by a JavaScript function.
subclass of: JavaScript executable

subClassOf
type: Property
comment: The subject is a subclass of a class.
domain: Class
range: Class

End-To-End Encryption for Jitsi Meet
type: CompletedProject
type: Proposal
type: Project
proposal name: End-To-End Encryption for Jitsi Meet
proposal status: Complete
proposal website: e2ee
to fund: PET Fund

SpecificResource
type: Class
comment: Instances of the SpecificResource class identify part of another resource (referenced with oa:hasSource), a particular representation of a resource, a resource with styling hints for renders, or any combination of these, as used within an Annotation.
subclass of: ResourceSelection

XMLLiteral
type: Class
type: Datatype
comment: The datatype of XML literal values.
subclass of: Literal

Pointer
type: Class
term status: stable

Meta-Press.es
type: CompletedProject
type: Proposal
type: Project
proposal name: Meta-Press.es
proposal status: Complete
proposal website: meta-press.es
to fund: Discovery Fund

CokoDocs
type: Proposal
type: Project
proposal name: CokoDocs
proposal status: Selected
proposal website: cokodocs.net
to fund: Core Fund

Unique-languages constraint component
type: Parameterizable
type: Constraint component
comment: A constraint component that can be used to specify that no pair of value nodes may use the same language tag.
parameter: UniqueLangConstraintComponent-uniqueLang

LibreOffice P2P
type: CompletedProject
type: Proposal
type: Project
proposal name: LibreOffice P2P
proposal status: Complete
proposal website: WASM
to fund: Discovery Fund

Dynamic indexing for real time graph database
type: CompletedProject
type: Proposal
type: Project
proposal name: Dynamic indexing for real time graph database
proposal status: Complete
proposal website: selva
to fund: Discovery Fund

RADIUSdesk Multi WAN
type: Proposal
type: Project
proposal name: RADIUSdesk Multi WAN
proposal status: Selected
proposal website: www.radiusdesk.com
to fund: Entrust Fund

algorithm
type: ObjectProperty
type: Property
comment: Identifies the algorithm used to produce the subject Checksum. Currently, SHA-1 is the only supported algorithm. It is anticipated that other algorithms will be supported at a later time.
domain: Checksum
term status: stable

System Improvements SimpleSAMLphp
type: RunningProject
type: Proposal
type: Project
proposal name: System Improvements SimpleSAMLphp
proposal status: Running
proposal website: simplesamlphp.org
to fund: Open Call

Create
type: Class
comment: To Create Something
subclass of: Activity

startTime
type: FunctionalProperty
type: Property
type: DatatypeProperty
comment: The starting time of the object
domain: Object
range: dateTime

OCap layer for Haskell actor library
type: RunningProject
type: Proposal
type: Project
proposal name: OCap layer for Haskell actor library
proposal status: Running
proposal website: actors-guild
to fund: Entrust Fund

ClosedConstraintComponent-ignoredProperties
type: Shape
type: Property shape
type: Parameter
optional: true
path: ignored properties

Popularizing PeerTube
type: Proposal
type: Project
proposal name: Popularizing PeerTube
proposal status: Selected
proposal website: joinpeertube.org
to fund: Entrust Fund

width
type: FunctionalProperty
type: Property
type: DatatypeProperty
comment: Specifies the preferred display width of the content, expressed in terms of device independent pixels.
domain: Link

StartEndPointer
type: Class
subclass of: CompoundPointer
subclass of: Class
  type: Restriction
  onClass: SinglePointer
  onProperty: startPointer
  qualifiedCardinality: 1
subclass of: Class
  type: Restriction
  onClass: SinglePointer
  onProperty: endPointer
  qualifiedCardinality: 1
term status: stable

max count
type: Property
comment: Specifies the maximum number of values in the set of value nodes.

rest
type: Property
comment: The rest of the subject RDF list after the first item.
domain: List
range: List

ISO 639-2
type: Datatype
type: Class
comment: The three-letter alphabetic codes listed in ISO639-2 for the representation of names of languages.
date: 2008-01-14
date: 2000-07-11
Relation: ISO639-2-003
Has Version: ISO639-2-003
issued: 2000-07-11
Date Modified: 2008-01-14

SeedVault
type: CompletedProject
type: Proposal
type: Project
proposal name: SeedVault
proposal status: Complete
proposal website: seedvault
to fund: PET Fund

created
type: DatatypeProperty
type: Property
comment: Identify when the SPDX document was originally created. The date is to be specified according to combined date and time in UTC format as specified in ISO 8601 standard.
domain: CreationInfo
range: dateTime
subPropertyOf: date
term status: stable

LinkedDataHub
type: CompletedProject
type: Proposal
type: Project
proposal name: LinkedDataHub
proposal status: Complete
proposal website: LinkedDataHub
to fund: Discovery Fund

JavaScript function
type: Class
comment: The class of SHACL functions that execute a JavaScript function when called.
subclass of: JavaScript executable
subclass of: Function

Authenticated DNSSEC bootstrapping
type: RunningProject
type: Proposal
type: Project
proposal name: Authenticated DNSSEC bootstrapping
proposal status: Running
proposal website: draft-thomassen-dnsop-dnssec-bootstrapping
to fund: Assure Fund

Mellium
type: Proposal
type: Project
proposal name: Mellium
proposal status: Selected
proposal website: mellium.im
to fund: Assure Fund

IrreflexiveProperty
type: Class
comment: The class of irreflexive properties.
subclass of: ObjectProperty

label template
type: Property
comment: Outlines how human-readable labels of instances of the associated Parameterizable shall be produced. The values can contain {?paramName} as placeholders for the actual values of the given parameter.
domain: Parameterizable

relationshipType devDependencyOf
type: RelationshipType
type: Thing
type: NamedIndividual
comment: Is to be used when SPDXRef-A is a development dependency of SPDXRef-B.
term status: stable

bcachefs
type: Proposal
type: Project
proposal name: bcachefs
proposal status: Selected
proposal website: bcachefs.org
to fund: Entrust Fund

duration
type: FunctionalProperty
type: Property
type: DatatypeProperty
comment: The duration of the object
domain: Object
range: duration

Leave
type: Class
comment: To Leave Something
subclass of: Activity

Statime PTP Master
type: CompletedProject
type: Proposal
type: Project
proposal name: Statime PTP Master
proposal status: Complete
proposal website: statime
to fund: Assure Fund

Strengthening NTP and NTS in ntpd-rs
type: RunningProject
type: Proposal
type: Project
proposal name: Strengthening NTP and NTS in ntpd-rs
proposal status: Running
proposal website: ntpd-rs
to fund: Entrust Fund

802.11n feature of openwifi
type: CompletedProject
type: Proposal
type: Project
proposal name: 802.11n feature of openwifi
proposal status: Complete
proposal website: openwifi
to fund: PET Fund

SignRoom
type: RunningProject
type: Proposal
type: Project
proposal name: SignRoom
proposal status: Running
proposal website: dyne.org
to fund: Assure Fund

purpose install
type: Purpose
type: Thing
type: NamedIndividual
comment: The package is used to install software on disk.
term status: stable

audience
type: Property
type: ObjectProperty
comment: Identifies one or more entities that represent the total population of entities for which the object can considered to be relevant.
domain: Object
range: Class
  unionOf: Object
  unionOf: Link

JavaScript rule
type: Class
comment: The class of SHACL rules expressed using JavaScript.
subclass of: JavaScript executable
subclass of: Rule

Bonfire Framework
type: RunningProject
type: Proposal
type: Project
proposal name: Bonfire Framework
proposal status: Running
proposal website: bonfirenetworks.org
to fund: Entrust Fund

DatatypeProperty
type: Class
comment: The class of data properties.
subclass of: Property

The RDF Concepts Vocabulary (RDF)
type: Ontology
date: 2019-12-16
description: This is the RDF Schema for the RDF vocabulary terms in the RDF Namespace, defined in RDF 1.1 Concepts.

Oils for Unix
type: RunningProject
type: Proposal
type: Project
proposal name: Oils for Unix
proposal status: Running
proposal website: www.oilshell.org
to fund: Entrust Fund

The RDF Schema vocabulary (RDFS)
type: Ontology

Date Modified
type: Property
comment: Date on which the resource was changed.
subPropertyOf: Date
date: 2000-07-11
date: 2008-01-14
description: Recommended practice is to describe the date, date/time, or period of time as recommended for the property Date, of which this is a subproperty.
Relation: modified-003
Has Version: modified-003
issued: 2000-07-11
Date Modified: 2008-01-14

ignored properties
type: Property
comment: An optional RDF list of properties that are also permitted in addition to those explicitly enumerated via sh:property/sh:path.
range: List

Node shape
type: Class
comment: A node shape is a shape that specifies constraint that need to be met with respect to focus nodes.
subclass of: Shape

Update
type: Class
comment: To Update/Modify Something
subclass of: Activity

exactly one
type: Property
comment: Specifies a list of shapes so that the value nodes must conform to exactly one of the shapes.
range: List

Lemmy private communities
type: Proposal
type: Project
proposal name: Lemmy private communities
proposal status: Selected
proposal website: join-lemmy.org
to fund: Entrust Fund

zero or one path
type: Property
comment: The (single) value of this property represents a path that is matched zero or one times.

startPointer
type: ObjectProperty
type: Property
domain: CompoundPointer
range: SinglePointer
term status: stable

Fleetbase on Solid: A production-ready supply chain solution
type: RunningProject
type: Proposal
type: Project
proposal name: Fleetbase on Solid: A production-ready supply chain solution
proposal status: Running
proposal website: fleetbase.io
to fund: Entrust Fund

sharedInbox
type: FunctionalProperty
type: Property
type: ObjectProperty
comment: An optional endpoint used for wide delivery of publicly addressed activities and activities sent to followers. sharedInbox endpoints SHOULD also be publicly readable OrderedCollection objects containing objects addressed to the Public special collection.
domain: Actor
range: OrderedActivityCollection

Layer-2-Overlay
type: RunningProject
type: Proposal
type: Project
proposal name: Layer-2-Overlay
proposal status: Running
proposal website: gnunet.org
to fund: Assure Fund

Verifpal
type: CompletedProject
type: Proposal
type: Project
proposal name: Verifpal
proposal status: Complete
proposal website: verifpal.com
to fund: PET Fund

isValid
type: DatatypeProperty
type: Property
comment: True if the URL is a valid well formed URL
domain: CrossRef

Reject
type: Class
comment: Actor rejects the Object
subclass of: Activity

eduVPN Legal
type: RunningProject
type: Proposal
type: Project
proposal name: eduVPN Legal
proposal status: Running
proposal website: eduvpn.org
to fund: VPN Fund

Improving Matrix E2E encryption UX
type: Proposal
type: Project
proposal name: Improving Matrix E2E encryption UX
proposal status: Selected
proposal website: matrix.org
to fund: InternetHardeningFund

Catalog Record
type: Class
comment: Záznam v datovém katalogu popisující jednu datovou sadu či datovou službu. @cs
comment: 1つのデータセットを記述したデータ・カタログ内のレコード。 @ja
comment: Un registre du catalogue ou une entrée du catalogue, décrivant un seul jeu de données. @fr
comment: A record in a data catalog, describing the registration of a single dataset or data service.
comment: Μία καταγραφή ενός καταλόγου, η οποία περιγράφει ένα συγκεκριμένο σύνολο δεδομένων. @el
comment: Un registro en un catálogo de datos que describe un solo conjunto de datos o un servicio de datos. @es
comment: En post i et datakatalog der beskriver registreringen af et enkelt datasæt eller en datatjeneste. @da
comment: Un record in un catalogo di dati che descrive un singolo dataset o servizio di dati. @it
label: Katalogizační záznam @cs
label: Registre du catalogue @fr
label: カタログ・レコード @ja
label: سجل @ar
label: Record di catalogo @it
label: Katalogpost @da
label: Καταγραφή καταλόγου @el
label: Registro del catálogo @es
subclass of: Class
  type: Restriction
  cardinality: 1
  onProperty: primaryTopic
subclass of: Class
  type: Restriction
  allValuesFrom: Catalogued resource
  onProperty: primaryTopic
editorial note: English definition updated in this revision. Multilingual text not yet updated except the Spanish one and the Czech one and Italian one.
scope note: Esta clase es opcional y no todos los catálogos la utilizarán. Esta clase existe para catálogos que hacen una distinción entre los metadatos acerca de un conjunto de datos o un servicio de datos y los metadatos acerca de una entrada en ese conjunto de datos en el catálogo. Por ejemplo, la propiedad sobre la fecha de la publicación de los datos refleja la fecha en que la información fue originalmente publicada, mientras que la fecha de publicación del registro del catálogo es la fecha en que los datos se agregaron al mismo. En caso en que ambas fechas fueran diferentes, o en que sólo la fecha de publicación del registro del catálogo estuviera disponible, sólo debe especificarse en el registro del catálogo. Tengan en cuenta que la ontología PROV de W3C permite describir otra información sobre la proveniencia de los datos, como por ejemplo detalles del proceso y de los agentes involucrados en algún cambio específico a los datos. @es
scope note: このクラスはオプションで、すべてのカタログがそれを用いるとは限りません。これは、データセットに関するメタデータとカタログ内のデータセットのエントリーに関するメタデータとで区別が行われるカタログのために存在しています。例えば、データセットの公開日プロパティーは、公開機関が情報を最初に利用可能とした日付を示しますが、カタログ・レコードの公開日は、データセットがカタログに追加された日付です。両方の日付が異っていたり、後者だけが分かっている場合は、カタログ・レコードに対してのみ公開日を指定すべきです。W3CのPROVオントロジー[prov-o]を用いれば、データセットに対する特定の変更に関連するプロセスやエージェントの詳細などの、さらに詳しい来歴情報の記述が可能となることに注意してください。 @ja
scope note: This class is optional and not all catalogs will use it. It exists for catalogs where a distinction is made between metadata about a dataset or data service and metadata about the entry for the dataset or data service in the catalog. For example, the publication date property of the dataset reflects the date when the information was originally made available by the publishing agency, while the publication date of the catalog record is the date when the dataset was added to the catalog. In cases where both dates differ, or where only the latter is known, the publication date should only be specified for the catalog record. Notice that the W3C PROV Ontology allows describing further provenance information such as the details of the process and the agent involved in a particular change to a dataset.
scope note: Questa classe è opzionale e non tutti i cataloghi la utilizzeranno. Esiste per cataloghi in cui si opera una distinzione tra i metadati relativi al dataset ed i metadati relativi alla gestione del dataset nel catalogo. Ad esempio, la proprietà per indicare la data di pubblicazione del dataset rifletterà la data in cui l'informazione è stata originariamente messa a disposizione dalla casa editrice, mentre la data di pubblicazione per il record nel catalogo rifletterà la data in cui il dataset è stato aggiunto al catalogo. Nei casi dove solo quest'ultima sia nota, si utilizzerà esclusivamente la data di pubblicazione relativa al record del catalogo. Si noti che l'Ontologia W3C PROV permette di descrivere ulteriori informazioni sulla provenienza, quali i dettagli del processo, la procedura e l'agente coinvolto in una particolare modifica di un dataset. @it
scope note: Tato třída je volitelná a ne všechny katalogy ji využijí. Existuje pro katalogy, ve kterých se rozlišují metadata datové sady či datové služby a metadata o záznamu o datové sadě či datové službě v katalogu. Například datum publikace datové sady odráží datum, kdy byla datová sada původně zveřejněna poskytovatelem dat, zatímco datum publikace katalogizačního záznamu je datum zanesení datové sady do katalogu. V případech kdy se obě data liší, nebo je známo jen to druhé, by mělo být specifikováno jen datum publikace katalogizačního záznamu. Všimněte si, že ontologie W3C PROV umožňuje popsat další informace o původu jako například podrobnosti o procesu konkrétní změny datové sady a jeho účastnících. @cs
scope note: Αυτή η κλάση είναι προαιρετική και δεν χρησιμοποιείται από όλους τους καταλόγους. Υπάρχει για τις περιπτώσεις καταλόγων όπου γίνεται διαχωρισμός μεταξύ των μεταδεδομένων για το σύνολο των δεδομένων και των μεταδεδομένων για την καταγραφή του συνόλου δεδομένων εντός του καταλόγου. Για παράδειγμα, η ιδιότητα της ημερομηνίας δημοσίευσης του συνόλου δεδομένων δείχνει την ημερομηνία κατά την οποία οι πληροφορίες έγιναν διαθέσιμες από τον φορέα δημοσίευσης, ενώ η ημερομηνία δημοσίευσης της καταγραφής του καταλόγου δείχνει την ημερομηνία που το σύνολο δεδομένων προστέθηκε στον κατάλογο. Σε περιπτώσεις που οι δύο ημερομηνίες διαφέρουν, ή που μόνο η τελευταία είναι γνωστή, η ημερομηνία δημοσίευσης θα πρέπει να δίνεται για την καταγραφή του καταλόγου. Να σημειωθεί πως η οντολογία W3C PROV επιτρέπει την περιγραφή επιπλέον πληροφοριών ιστορικού όπως λεπτομέρειες για τη διαδικασία και τον δράστη που εμπλέκονται σε μία συγκεκριμένη αλλαγή εντός του συνόλου δεδομένων. @el
scope note: C'est une classe facultative et tous les catalogues ne l'utiliseront pas. Cette classe existe pour les catalogues ayant une distinction entre les métadonnées sur le jeu de données et les métadonnées sur une entrée du jeu de données dans le catalogue. @fr
scope note: Denne klasse er valgfri og ikke alle kataloger vil anvende denne klasse. Den kan anvendes i de kataloger hvor der skelnes mellem metadata om datasættet eller datatjenesten og metadata om selve posten til registreringen af datasættet eller datatjenesten i kataloget. Udgivelsesdatoen for datasættet afspejler for eksempel den dato hvor informationerne oprindeligt blev gjort tilgængelige af udgiveren, hvorimod udgivelsesdatoen for katalogposten er den dato hvor datasættet blev føjet til kataloget. I de tilfælde hvor de to datoer er forskellige eller hvor blot sidstnævnte er kendt, bør udgivelsesdatoen kun angives for katalogposten. Bemærk at W3Cs PROV ontologi gør til muligt at tilføje yderligere proveniensoplysninger eksempelvis om processen eller aktøren involveret i en given ændring af datasættet. @da

Yrs weak links
type: RunningProject
type: Proposal
type: Project
proposal name: Yrs weak links
proposal status: Running
proposal website: yjs.dev
to fund: Entrust Fund

Coloquinte
type: RunningProject
type: Proposal
type: Project
proposal name: Coloquinte
proposal status: Running
proposal website: Coloquinte placement
to fund: Entrust Fund

Web Annotation Ontology
type: Ontology
comment: The Web Annotation ontology defines the terms of the Web Annotation vocabulary. Any changes to this document MUST be from a Working Group in the W3C that has established expertise in the area.
Contributor: Robert Sanderson
Contributor: Paolo Ciccarese
Contributor: Benjamin Young
creator: Robert Sanderson
creator: Paolo Ciccarese
creator: Benjamin Young
date: 2016-11-12T21:28:11Z
Date Modified: 2016-11-12T21:28:11Z
versionInfo: 2016-11-12T21:28:11Z
was revision of: oa.owl

StreetComplete UX
type: CompletedProject
type: Proposal
type: Project
proposal name: StreetComplete UX
proposal status: Complete
proposal website: StreetComplete
to fund: Discovery Fund

Apicula
type: RunningProject
type: Proposal
type: Project
proposal name: Apicula
proposal status: Running
proposal website: apicula
to fund: Entrust Fund

SimpleSAMLphp Fund
fund label: SimpleSAMLphp Fund
fund status: Open
proposals accepted: 1
proposals submitted: 1

fileType audio
type: Thing
type: NamedIndividual
type: FileType
comment: The file is associated with an audio file (MIME type of audio/* , ie. .mp3 ); IMAGE if the file is assoicated with an picture image file (MIME type of image/*, ie. .jpg, .gif )
term status: stable

published
type: FunctionalProperty
type: Property
type: DatatypeProperty
comment: Specifies the date and time the object was published
domain: Object
range: dateTime

differentFrom
type: Property
comment: The property that determines that two given individuals are different.
domain: Thing
range: Thing

identifying
type: Concept
type: Motivation
comment: The motivation for when the user intends to assign an identity to the Target or identify what is being depicted or described in the Target.

Bibliographic Resource
type: Class
comment: A book, article, or other documentary resource.
date: 2008-01-14
Relation: BibliographicResource-001
Has Version: BibliographicResource-001
issued: 2008-01-14

VFRAME: Visual Defense Tools
type: CompletedProject
type: Proposal
type: Project
proposal name: VFRAME: Visual Defense Tools
proposal status: Complete
proposal website: vframe.io
to fund: PET Fund

it
type: Proposal
type: Project
proposal name: it
proposal status: Selected
proposal website: it
to fund: Entrust Fund

Benjamin Young
type: Agent
type: Person

snippetFromFile
type: Property
type: ObjectProperty
comment: File containing the SPDX element (e.g. the file contaning a snippet).
domain: Snippet
range: File
term status: stable

uFork
type: RunningProject
type: Proposal
type: Project
proposal name: uFork
proposal status: Running
proposal website: uFork
to fund: Entrust Fund

access address
type: ObjectProperty
type: Property
comment: أي رابط يتيح الوصول إلى البيانات. إذا كان الرابط هو ربط مباشر لملف يمكن تحميله استخدم الخاصية downloadURL @ar
comment: Ceci peut être tout type d'URL qui donne accès à une distribution du jeu de données. Par exemple, un lien à une page HTML contenant un lien au jeu de données, un Flux RSS, un point d'accès SPARQL. Utilisez le lorsque votre catalogue ne contient pas d'information sur quoi il est ou quand ce n'est pas téléchargeable. @fr
comment: データセットの配信にアクセス権を与えるランディング・ページ、フィード、SPARQLエンドポイント、その他の種類の資源。 @ja
comment: Un URL di una risorsa che consente di accedere a una distribuzione del set di dati. Per esempio, pagina di destinazione, feed, endpoint SPARQL. Da utilizzare per tutti i casi, tranne quando si tratta di un semplice link per il download nel qual caso è preferito downloadURL. @it
comment: Μπορεί να είναι οποιουδήποτε είδους URL που δίνει πρόσβαση στη διανομή ενός συνόλου δεδομένων. Π.χ. ιστοσελίδα αρχικής πρόσβασης, μεταφόρτωση, feed URL, σημείο διάθεσης SPARQL. Να χρησιμοποιείται όταν ο κατάλογος δεν περιέχει πληροφορίες εαν πρόκειται ή όχι για μεταφορτώσιμο αρχείο. @el
comment: URL zdroje, přes které je přístupná distribuce datové sady. Příkladem může být vstupní stránka, RSS kanál či SPARQL endpoint. Použijte ve všech případech kromě URL souboru ke stažení, pro které je lepší použít dcat:downloadURL. @cs
comment: En URL for en ressource som giver adgang til en repræsentation af datsættet. Fx destinationsside, feed, SPARQL-endpoint. Anvendes i alle sammenhænge undtagen til angivelse af et simpelt download link hvor anvendelse af egenskaben downloadURL foretrækkes. @da
comment: Puede ser cualquier tipo de URL que de acceso a una distribución del conjunto de datos, e.g., página de destino, descarga, URL feed, punto de acceso SPARQL. Esta propriedad se debe usar cuando su catálogo de datos no tiene información sobre donde está o cuando no se puede descargar. @es
comment: A URL of a resource that gives access to a distribution of the dataset. E.g. landing page, feed, SPARQL endpoint. Use for all cases except a simple download link, in which case downloadURL is preferred.
domain: Distribution
label: adgangsadresse @da
label: indirizzo di accesso @it
label: URL de acceso @es
label: رابط وصول @ar
label: URL πρόσβασης @el
label: アクセスURL @ja
label: URL d'accès @fr
label: přístupová adresa @cs
propertyChainAxiom: data access service
propertyChainAxiom: service end-point
alternative label: adgangsURL @da
editorial note: Status: English Definition text modified by DCAT revision team, updated Italian and Czech translation provided, translations for other languages pending.
editorial note: rdfs:label, rdfs:comment and skos:scopeNote have been modified. Non-english versions except for Italian must be updated.
scope note: If the distribution(s) are accessible only through a landing page (i.e. direct download URLs are not known), then the landing page link should be duplicated as accessURL on a distribution.
scope note: 確実にダウンロードでない場合や、ダウンロードかどうかが不明である場合は、downloadURLではなく、accessURLを用いてください。ランディング・ページを通じてしか配信にアクセスできない場合（つまり、直接的なダウンロードURLが不明）は、配信におけるaccessURLとしてランディング・ページのリンクをコピーすべきです（SHOULD）。 @ja
scope note: La valeur est une URL. Si la distribution est accessible seulement au travers d'une page d'atterrissage (c-à-dire on n'ignore une URL de téléchargement direct), alors le lien à la page d'atterrissage doit être dupliqué comee accessURL sur la distribution. @fr
scope note: Η τιμή είναι ένα URL. Αν η/οι διανομή/ές είναι προσβάσιμη/ες μόνο μέσω μίας ιστοσελίδας αρχικής πρόσβασης (δηλαδή αν δεν υπάρχουν γνωστές διευθύνσεις άμεσης μεταφόρτωσης), τότε ο σύνδεσμος της ιστοσελίδας αρχικής πρόσβασης πρέπει να αναπαραχθεί ως accessURL σε μία διανομή. @el
scope note: El rango es una URL. Si la distribución es accesible solamente través de una página de destino (es decir, si no se conoce una URL de descarga directa), entonces el enlance a la página de destino debe ser duplicado como accessURL en la distribución. @es
scope note: Pokud jsou distribuce přístupné pouze přes vstupní stránku (tj. URL pro přímé stažení nejsou známa), pak by URL přístupové stránky mělo být duplikováno ve vlastnosti distribuce accessURL. @cs
scope note: Hvis en eller flere distributioner kun er tilgængelige via en destinationsside (dvs. en URL til direkte download er ikke kendt), så bør destinationssidelinket gentages som adgangsadresse for distributionen. @da
scope note: Se le distribuzioni sono accessibili solo attraverso una pagina web (ad esempio, gli URL per il download diretto non sono noti), allora il link della pagina web deve essere duplicato come accessURL sulla distribuzione. @it

Local Production of Antennas for LibreRouter (LoPaLiR)
type: CompletedProject
type: Proposal
type: Project
proposal name: Local Production of Antennas for LibreRouter (LoPaLiR)
proposal status: Complete
proposal website: altermundi.net
to fund: UOI Fund

Group
type: Class
comment: A Group of any kind.
subclass of: Object

relationshipType providedDependencyOf
type: RelationshipType
type: Thing
type: NamedIndividual
comment: Is to be used when SPDXRef-A is a to be provided dependency of SPDXRef-B.
term status: stable

exceptionTextHtml
type: DatatypeProperty
type: Property
comment: HTML representation of the License Exception Text
domain: ListedLicenseException
term status: stable

Namecoin: ZeroNet and Packaging
type: Proposal
type: Project
proposal name: Namecoin: ZeroNet and Packaging
proposal status: Selected
proposal website: www.namecoin.org
to fund: Discovery Fund

EGIL SCIM client
type: CompletedProject
type: Proposal
type: Project
proposal name: EGIL SCIM client
proposal status: Complete
proposal website: egil-scimclient-esc
to fund: PET Fund

tagging
type: Concept
type: Motivation
comment: The motivation for when the user intends to associate a tag with the Target.

Topola
type: RunningProject
type: Proposal
type: Project
proposal name: Topola
proposal status: Running
proposal website: topola
to fund: Entrust Fund

hasSelector
type: Property
comment: The object of the relationship is a Selector that describes the segment or region of interest within the source resource. Please note that the domain ( oa:ResourceSelection ) is not used directly in the Web Annotation model.
domain: ResourceSelection
range: Selector

context
type: Property
type: ObjectProperty
comment: Specifies the context within which an object exists or an activity was performed
domain: Object
range: Class
  unionOf: Object
  unionOf: Link

annotationDate
type: DatatypeProperty
type: Property
comment: Identify when the comment was made. This is to be specified according to the combined date and time in the UTC format, as specified in the ISO 8601 standard.
domain: Annotation
range: dateTime
subPropertyOf: date
term status: stable

ISO 3166
type: Datatype
type: Class
comment: The set of codes listed in ISO 3166-1 for the representation of names of countries.
date: 2008-01-14
date: 2000-07-11
Relation: ISO3166-004
Has Version: ISO3166-004
issued: 2000-07-11
Date Modified: 2008-01-14

Oil Shell
type: CompletedProject
type: Proposal
type: Project
proposal name: Oil Shell
proposal status: Complete
proposal website: www.oilshell.org
to fund: Assure Fund

relationship
type: Property
type: ObjectProperty
comment: On a Relationship object, describes the type of relationship
domain: Relationship
range: Property
subPropertyOf: predicate

Nominatim as a library
type: CompletedProject
type: Proposal
type: Project
proposal name: Nominatim as a library
proposal status: Complete
proposal website: nominatim.org
to fund: Entrust Fund

SensifAI
type: Proposal
type: Project
proposal name: SensifAI
proposal status: Selected
proposal website: sensifai.com
to fund: Discovery Fund

LanguageInConstraintComponent-languageIn
type: Shape
type: Property shape
type: Parameter
max count: 1
path: language in

result
type: Property
comment: The validation results contained in a validation report.
domain: Validation report
range: Validation result

bodyValue
type: Property
comment: The object of the predicate is a plain text string to be used as the content of the body of the Annotation. The value MUST be an xsd:string and that data type MUST NOT be expressed in the serialization. Note that language MUST NOT be associated with the value either as a language tag, as that is only available for rdf:langString .
domain: Annotation

Fractal
type: CompletedProject
type: Proposal
type: Project
proposal name: Fractal
proposal status: Complete
proposal website: fractal
to fund: PET Fund

The Open Green Web
type: CompletedProject
type: Proposal
type: Project
proposal name: The Open Green Web
proposal status: Complete
proposal website: www.thegreenwebfoundation.org
to fund: Discovery Fund

mikroPhone
type: RunningProject
type: Proposal
type: Project
proposal name: mikroPhone
proposal status: Running
proposal website: mikrophone.net
to fund: Entrust Fund

Description
type: Property
comment: An account of the resource.
date: 1999-07-02
description: Description may include but is not limited to: an abstract, a table of contents, a graphical representation, or a free-text account of the resource.
issued: 1999-07-02
note: A [second property](/specifications/dublin-core/dcmi-terms/#http://purl.org/dc/terms/description) with the same name as this property has been declared in the [dcterms: namespace](http://purl.org/dc/terms/). See the Introduction to the document [DCMI Metadata Terms](/specifications/dublin-core/dcmi-terms/) for an explanation.

or
type: Property
comment: Specifies a list of shapes so that the value nodes must conform to at least one of the shapes.
range: List

oneOf
type: Property
comment: The property that determines the collection of individuals or data values that build an enumeration.
domain: Class
range: List

Seq
type: Class
comment: The class of ordered containers.
subclass of: Container

Kintex-nextpnr
type: CompletedProject
type: Proposal
type: Project
proposal name: Kintex-nextpnr
proposal status: Complete
proposal website: kintex-chatter
to fund: Assure Fund

TrenchBoot for AMD platform in Linux kernel
type: Proposal
type: Project
proposal name: TrenchBoot for AMD platform in Linux kernel
proposal status: Selected
proposal website: trenchboot.org
to fund: Entrust Fund

Full-source GNU Mes on ARM and RISC-V
type: CompletedProject
type: Proposal
type: Project
proposal name: Full-source GNU Mes on ARM and RISC-V
proposal status: Complete
proposal website: mes
to fund: Assure Fund

AllDisjointClasses
type: Class
comment: The class of collections of pairwise disjoint classes.
subclass of: Resource

FileSender
type: Proposal
type: Project
proposal name: FileSender
proposal status: Selected
proposal website: filesender.org
to fund: FileSender

Robert Sanderson
type: Agent
type: Person

Chips4Makers ASICs
type: CompletedProject
type: Proposal
type: Project
proposal name: Chips4Makers ASICs
proposal status: Complete
proposal website: blog
to fund: PET Fund

DCMI Type Vocabulary
type: VocabularyEncodingScheme
comment: The set of classes specified by the DCMI Type Vocabulary, used to categorize the nature or genre of the resource.
date: 2000-07-11
date: 2012-06-14
Relation: DCMIType-005
Has Version: DCMIType-005
issued: 2000-07-11
Date Modified: 2012-06-14

Service
type: Class
comment: A service provided by some entity
subclass of: Object

Page
type: Class
comment: A Web Page
subclass of: Object

Irdest - OpenWRT Image and Bluetooth LE
type: RunningProject
type: Proposal
type: Project
proposal name: Irdest - OpenWRT Image and Bluetooth LE
proposal status: Running
proposal website: irde.st
to fund: Entrust Fund

HttpRequestState
type: Class
comment: The HttpRequestState class is used to record the HTTP request headers that a client SHOULD use to request the correct representation from the resource.
subclass of: State

Media Type or Extent
type: Class
comment: A media type or extent.
date: 2008-01-14
Relation: MediaTypeOrExtent-001
Has Version: MediaTypeOrExtent-001
issued: 2008-01-14

Icebreaker
type: CompletedProject
type: Proposal
type: Project
proposal name: Icebreaker
proposal status: Complete
proposal website: www.icebreaker.space
to fund: Discovery Fund

Corteza Discovery
type: CompletedProject
type: Proposal
type: Project
proposal name: Corteza Discovery
proposal status: Complete
proposal website: www.cortezaproject.org
to fund: Discovery Fund

inReplyTo
type: Property
type: ObjectProperty
comment: Indicates one or more entities for which this object is considered a response.
domain: Object
range: Class
  unionOf: Object
  unionOf: Link

Tvix-{Store/Build}
type: RunningProject
type: Proposal
type: Project
proposal name: Tvix-{Store/Build}
proposal status: Running
proposal website: tvix.dev
to fund: Core Fund

Open source SDR hardware based on ZYNQ7000+AD936X
type: Proposal
type: Project
proposal name: Open source SDR hardware based on ZYNQ7000+AD936X
proposal status: Selected
proposal website: wiki
to fund: NREN

SPARQL CONSTRUCT executable
type: Class
comment: The class of SPARQL executables that are based on a CONSTRUCT query.
subclass of: SPARQL executable

Open Cloud Mesh
type: RunningProject
type: Proposal
type: Project
proposal name: Open Cloud Mesh
proposal status: Running
proposal website: OCM-API
to fund: Core Fund

Result annotation
type: Class
comment: A class of result annotations, which define the rules to derive the values of a given annotation property as extra values for a validation result.
subclass of: Resource

hasValue
type: Property
comment: The property that determines the individual that a has-value restriction refers to.
domain: Restriction

bottomObjectProperty
type: Property
type: ObjectProperty
comment: The object property that does not relate any two individuals.
domain: Thing
range: Thing

FileSender IDOR and Rate Limiting
type: CompletedProject
type: Proposal
type: Project
proposal name: FileSender IDOR and Rate Limiting
proposal status: Complete
proposal website: filesender.org
to fund: FileSender

FastWave
type: Proposal
type: Project
proposal name: FastWave
proposal status: Selected
proposal website: FastWaveBackend
to fund: Entrust Fund

instrument
type: Property
type: ObjectProperty
comment: Indentifies an object used (or to be used) to complete an activity
domain: Activity
range: Class
  unionOf: Object
  unionOf: Link

sameAs
type: Property
comment: The property that determines that two given individuals are equal.
domain: Thing
range: Thing

TPM 2.0 for HEADS
type: CompletedProject
type: Proposal
type: Project
proposal name: TPM 2.0 for HEADS
proposal status: Complete
proposal website: heads
to fund: Assure Fund

UOI Fund
fund label: User-operated Internet Fund
fund status: Open
proposals accepted: 11
proposals submitted: 169

State
type: Class
comment: A State describes the intended state of a resource as applied to the particular Annotation, and thus provides the information needed to retrieve the correct representation of that resource.

Follow
type: Class
comment: To Express Interest in Something
subclass of: Activity

formerType
type: FunctionalProperty
type: Property
type: ObjectProperty
comment: On a Tombstone object, describes the former type of the deleted object
domain: Tombstone
range: Object

Automerge
type: RunningProject
type: Proposal
type: Project
proposal name: Automerge
proposal status: Running
proposal website: automerge.org
to fund: Core Fund

Physical Resource
type: Class
comment: A material thing.
date: 2008-01-14
Relation: PhysicalResource-001
Has Version: PhysicalResource-001
issued: 2008-01-14

Method of Instruction
type: Class
comment: A process that is used to engender knowledge, attitudes, and skills.
date: 2008-01-14
Relation: MethodOfInstruction-001
Has Version: MethodOfInstruction-001
issued: 2008-01-14

Spatial Coverage
type: Property
comment: Spatial characteristics of the resource.
range: Location
subPropertyOf: Coverage
range includes: Location
date: 2000-07-11
date: 2008-01-14
Relation: spatial-003
Has Version: spatial-003
issued: 2000-07-11
Date Modified: 2008-01-14

reviewer
type: Property
type: DatatypeProperty
comment: The name and, optionally, contact information of the person who performed the review. Values of this property must conform to the agent and tool syntax. The reviewer property is deprecated in favor of Annotation with an annotationType review.
domain: Review
deprecated: true
term status: deprecated

Monal IM UI
type: Proposal
type: Project
proposal name: Monal IM UI
proposal status: Selected
proposal website: monal-im.org
to fund: Entrust Fund

focus node
type: Property
comment: The focus node that was validated when the result was produced.
domain: Abstract result

Undo
type: Class
comment: To Undo Something. This would typically be used to indicate that a previous Activity has been undone.
subclass of: Activity

Jakub Klímek
type: Agent

BinaryAnalysisFund
fund label: Binary Analysis Fund
fund status: Open
proposals accepted: 4
proposals submitted: 7

RFC 3066
type: Datatype
type: Class
comment: The set of tags constructed according to RFC 3066 for the identification of languages.
date: 2008-01-14
date: 2002-07-13
description: RFC 3066 has been obsoleted by RFC 4646.
Relation: RFC3066-002
Has Version: RFC3066-002
issued: 2002-07-13
Date Modified: 2008-01-14

relationshipType dataFileOf
type: RelationshipType
type: Thing
type: NamedIndividual
comment: Is to be used when SPDXRef-A is a data file used in SPDXRef-B.
term status: stable

annotation
type: Property
type: ObjectProperty
comment: Provide additional information about an SpdxElement.
domain: SpdxElement
range: Annotation
term status: stable

Improving and extending Kaitai Struct
type: RunningProject
type: Proposal
type: Project
proposal name: Improving and extending Kaitai Struct
proposal status: Running
proposal website: kaitai.io
to fund: Entrust Fund

RNP Confium
type: CompletedProject
type: Proposal
type: Project
proposal name: RNP Confium
proposal status: Complete
proposal website: www.rnpgp.com
to fund: PET Fund

Quantum-Proof Zenroom
type: CompletedProject
type: Proposal
type: Project
proposal name: Quantum-Proof Zenroom
proposal status: Complete
proposal website: zenroom.org
to fund: Assure Fund

Date Issued
type: Property
comment: Date of formal issuance (e.g., publication) of the resource.
comment: Date of formal issuance of the resource.
subPropertyOf: Date
date: 2008-01-14
date: 2000-07-11
description: Recommended practice is to describe the date, date/time, or period of time as recommended for the property Date, of which this is a subproperty.
Relation: issued-003
Has Version: issued-003
issued: 2000-07-11
Date Modified: 2008-01-14

AnnotationProperty
type: Class
comment: The class of annotation properties.
subclass of: Property

hasTarget
type: Property
comment: The relationship between an Annotation and its Target.
domain: Annotation

sourceIndividual
type: Property
comment: The property that determines the subject of a negative property assertion.
domain: NegativePropertyAssertion
range: Thing

commenting
type: Concept
type: Motivation
comment: The motivation for when the user intends to comment about the Target.

replying
type: Concept
type: Motivation
comment: The motivation for when the user intends to reply to a previous statement, either an Annotation or another resource.

Description
type: Property
comment: An account of the resource.
subPropertyOf: Description
date: 2008-01-14
description: Description may include but is not limited to: an abstract, a table of contents, a graphical representation, or a free-text account of the resource.
Relation: descriptionT-001
Has Version: descriptionT-001
issued: 2008-01-14
Date Modified: 2008-01-14

Vula
type: Proposal
type: Project
proposal name: Vula
proposal status: Selected
proposal website: vula.link
to fund: Assure Fund

Slint port for Android
type: RunningProject
type: Proposal
type: Project
proposal name: Slint port for Android
proposal status: Running
proposal website: slint
to fund: Core Fund

Dataset
type: Class
comment: En samling af data, udgivet eller udvalgt og arrangeret af en enkelt kilde og som er til råde for adgang til eller download af i en eller flere repræsentationer. @da
comment: Una colección de datos, publicados o conservados por una única fuente, y disponibles para ser accedidos o descargados en uno o más formatos. @es
comment: Kolekce dat poskytovaná či řízená jedním zdrojem, která je k dispozici pro přístup či stažení v jednom či více formátech. @cs
comment: Une collection de données, publiée ou élaborée par une seule source, et disponible pour accès ou téléchargement dans un ou plusieurs formats. @fr
comment: A collection of data, published or curated by a single source, and available for access or download in one or more representations.
comment: قائمة بيانات منشورة أو مجموعة من قبل مصدر ما و متاح الوصول إليها أو تحميلها @ar
comment: Μία συλλογή από δεδομένα, δημοσιευμένη ή επιμελημένη από μία και μόνο πηγή, διαθέσιμη δε προς πρόσβαση ή μεταφόρτωση σε μία ή περισσότερες μορφές. @el
comment: Raccolta di dati, pubblicati o curati da un'unica fonte, disponibili per l'accesso o il download in uno o più formati. @it
comment: 1つのエージェントによって公開またはキュレートされ、1つ以上の形式でアクセスまたはダウンロードできるデータの集合。 @ja
label: Datasæt @da
label: Datová sada @cs
label: Jeu de données @fr
label: Σύνολο Δεδομένων @el
label: Conjunto de datos @es
label: قائمة بيانات @ar
label: データセット @ja
subclass of: Catalogued resource
alternative label: Datasamling @da
change note: 2018-02 - sottoclasse di dctype:Dataset rimosso perché l'ambito di dcat:Dataset include diversi altri tipi dal vocabolario dctype. @it
change note: 2018-02 - se eliminó el axioma de subclase con dctype:Dataset porque el alcance de dcat:Dataset incluye muchos otros tipos del vocabulario dctype. @es
change note: 2018-02 - subclass of dctype:Dataset removed because scope of dcat:Dataset includes several other types from the dctype vocabulary.
change note: 2018-02 - odstraněno tvrzení o podtřídě dctype:Dataset, jelikož rozsah dcat:Dataset zahrnuje několik dalších typů ze slovníku dctype. @cs
change note: 2018-02 - subklasse af dctype:Dataset fjernet da scope af dcat:Dataset omfatter flere forskellige typer fra dctype-vokabularet. @da
definition: A collection of data, published or curated by a single source, and available for access or download in one or more represenations.
definition: En samling a data, udgivet eller udvalgt og arrangeret af en enkelt kilde og som der er adgang til i en eller flere repræsentationer. @da
editorial note: 2020-03-16 A new scopenote added and need to be translated
scope note: Denne klasse repræsenterer det konkrete datasæt som det udgives af datasætleverandøren. I de tilfælde hvor det er nødvendigt at skelne mellem det konkrete datasæt og dets registrering i kataloget (fordi metadata såsom ændringsdato og vedligeholder er forskellige), så kan klassen katalogpost anvendes. @da
scope note: Denne klasse beskriver det konceptuelle datasæt. En eller flere repræsentationer kan være tilgængelige med forskellige skematiske opsætninger, formater eller serialiseringer. @da
scope note: The notion of dataset in DCAT is broad and inclusive, with the intention of accommodating resource types arising from all communities. Data comes in many forms including numbers, text, pixels, imagery, sound and other multi-media, and potentially other types, any of which might be collected into a dataset.
scope note: このクラスは、データセットの公開者が公開する実際のデータセットを表わします。カタログ内の実際のデータセットとそのエントリーとの区別が必要な場合（修正日と維持者などのメタデータが異なるかもしれないので）は、後者にcatalog recordというクラスを使用できます。 @ja
scope note: This class describes the conceptual dataset. One or more representations might be available, with differing schematic layouts and formats or serializations.
scope note: Questa classe descrive il dataset dal punto di vista concettuale. Possono essere disponibili una o più rappresentazioni, con diversi layout e formati schematici o serializzazioni. @it
scope note: Tato třída reprezentuje datovou sadu tak, jak je publikována poskytovatelem dat. V případě potřeby rozlišení datové sady a jejího katalogizačního záznamu (jelikož metadata jako datum modifikace se mohou lišit) pro něj může být použita třída "katalogizační záznam". @cs
scope note: This class represents the actual dataset as published by the dataset provider. In cases where a distinction between the actual dataset and its entry in the catalog is necessary (because metadata such as modification date and maintainer might differ), the catalog record class can be used for the latter.
scope note: Η κλάση αυτή αναπαριστά το σύνολο δεδομένων αυτό καθ'εαυτό, όπως έχει δημοσιευθεί από τον εκδότη. Σε περιπτώσεις όπου είναι απαραίτητος ο διαχωρισμός μεταξύ του συνόλου δεδομένων και της καταγραφής αυτού στον κατάλογο (γιατί μεταδεδομένα όπως η ημερομηνία αλλαγής και ο συντηρητής μπορεί να διαφέρουν) η κλάση της καταγραφής καταλόγου μπορεί να χρησιμοποιηθεί για το τελευταίο. @el
scope note: Esta clase representa el conjunto de datos publicados. En los casos donde es necesario distinguir entre el conjunto de datos y su entrada en el catálogo de datos, se debe utilizar la clase 'registro del catálogo'. @es
scope note: Cette classe représente le jeu de données publié par le fournisseur de données. Dans les cas où une distinction est nécessaire entre le jeu de donénes et son entrée dans le catalogue, la classe registre de données peut être utilisée pour ce dernier. @fr
scope note: Questa classe rappresenta il dataset come pubblicato dall’editore. Nel caso in cui sia necessario operare una distinzione fra i metadati originali del dataset e il record dei metadati ad esso associato nel catalogo (ad esempio, per distinguere la data di modifica del dataset da quella del dataset nel catalogo) si può impiegare la classe catalog record. @it

packageVerificationCode
type: ObjectProperty
type: Property
comment: A manifest based verification code (the algorithm is defined in section 3.9.4 of the full specification) of the package. This allows consumers of this data and/or database to determine if a package they have in hand is identical to the package from which the data was produced. This algorithm works even if the SPDX document is included in the package.
domain: Package
range: PackageVerificationCode
term status: stable

Closed constraint component
type: Parameterizable
type: Constraint component
comment: A constraint component that can be used to indicate that focus nodes must only have values for those properties that have been explicitly enumerated via sh:property/sh:path.
parameter: ClosedConstraintComponent-closed
parameter: ClosedConstraintComponent-ignoredProperties

OVT 13
type: RunningProject
type: Proposal
type: Project
proposal name: OVT 13
proposal status: Running
proposal website: open-source-laptop-part-one
to fund: Entrust Fund

Geographic tagging of Routing and Forwarding
type: Proposal
type: Project
proposal name: Geographic tagging of Routing and Forwarding
proposal status: Selected
proposal website: scion-architecture.net
to fund: Discovery Fund

class
type: Property
comment: The type that all value nodes must have.
range: Class

Rust Threadpool
type: CompletedProject
type: Proposal
type: Project
proposal name: Rust Threadpool
proposal status: Complete
proposal website: rust-threadpool
to fund: PET Fund

EEZ DIB
type: CompletedProject
type: Proposal
type: Project
proposal name: EEZ DIB
proposal status: Complete
proposal website: introduction.html
to fund: PET Fund

Web Shell
type: CompletedProject
type: Proposal
type: Project
proposal name: Web Shell
proposal status: Complete
proposal website: WebShell
to fund: PET Fund

Kaidan
type: RunningProject
type: Proposal
type: Project
proposal name: Kaidan
proposal status: Running
proposal website: kaidan.im
to fund: Assure Fund

standardLicenseHeaderTemplate
type: DatatypeProperty
type: Property
comment: License template which describes sections of the license header which can be varied. See License Template section of the specification for format information.
domain: License
term status: stable

Image
type: Class
comment: An Image file
subclass of: Document

DDC
type: VocabularyEncodingScheme
comment: The set of conceptual resources specified by the Dewey Decimal Classification.
date: 2000-07-11
date: 2008-01-14
Relation: DDC-003
Has Version: DDC-003
issued: 2000-07-11
Date Modified: 2008-01-14

Date Valid
type: Property
comment: Date (often a range) of validity of a resource.
subPropertyOf: Date
date: 2008-01-14
date: 2000-07-11
description: Recommended practice is to describe the date, date/time, or period of time as recommended for the property Date, of which this is a subproperty.
Relation: valid-003
Has Version: valid-003
issued: 2000-07-11
Date Modified: 2008-01-14

A Distributed Software Stack For Co-operation
type: CompletedProject
type: Proposal
type: Project
proposal name: A Distributed Software Stack For Co-operation
proposal status: Complete
proposal website: academy.perspect.it
to fund: Discovery Fund

first
type: FunctionalProperty
type: Property
type: ObjectProperty
domain: Collection
range: Class
  unionOf: CollectionPage
  unionOf: Link

minQualifiedCardinality
type: Property
comment: The property that determines the cardinality of a minimum qualified cardinality restriction.
domain: Restriction

liked
type: Property
type: ObjectProperty
comment: The objects that an actor has liked.
domain: Actor
range: Class
  unionOf: OrderedCollection
  unionOf: Collection

Vouivre
type: Proposal
type: Project
proposal name: Vouivre
proposal status: Selected
proposal website: vouivredigital.com
to fund: Core Fund

Organic Maps
type: RunningProject
type: Proposal
type: Project
proposal name: Organic Maps
proposal status: Running
proposal website: organicmaps.app
to fund: Entrust Fund

inverseOf
type: Property
comment: The property that determines that two given properties are inverse.
domain: ObjectProperty
range: ObjectProperty

BlockNote
type: Proposal
type: Project
proposal name: BlockNote
proposal status: Selected
proposal website: www.blocknotejs.org
to fund: Entrust Fund

Audience Education Level
type: Property
comment: A class of entity, defined in terms of progression through an educational or training context, for which the described resource is intended.
comment: A class of agents, defined in terms of progression through an educational or training context, for which the described resource is intended.
range: Agent Class
subPropertyOf: Audience
range includes: Agent Class
date: 2002-07-13
date: 2008-01-14
Relation: educationLevel-002
Has Version: educationLevel-002
issued: 2002-07-13
Date Modified: 2008-01-14

Monal IM
type: RunningProject
type: Proposal
type: Project
proposal name: Monal IM
proposal status: Running
proposal website: monal.im
to fund: Assure Fund

Entrust Fund
fund label: NGI0 Entrust
fund status: Open
proposals accepted: 214
proposals submitted: 916

Vassilios Peristeras
type: Agent
affiliation: European Commission, DG DIGIT

validUntilDate
type: DatatypeProperty
type: Property
comment: This field provides a place for recording the end of the support period for a package from the supplier.
domain: Package
range: dateTime
subPropertyOf: date
term status: stable

isLive
type: DatatypeProperty
type: Property
comment: Indicate a URL is still a live accessible location on the public internet
domain: CrossRef

onClass
type: Property
comment: The property that determines the class that a qualified object cardinality restriction refers to.
domain: Restriction
range: Class

attributedTo
type: Property
type: ObjectProperty
comment: Identifies an entity to which an object is attributed
domain: Class
  unionOf: Object
  unionOf: Link
range: Class
  unionOf: Object
  unionOf: Link

IN COMMON
type: CompletedProject
type: Proposal
type: Project
proposal name: IN COMMON
proposal status: Complete
proposal website: incommon.cc
to fund: Discovery Fund

PreferContainedIRIs
comment: An IRI to signal that the client prefers to receive only the IRIs of the Annotations from a container, not their full descriptions.

homepage
type: DatatypeProperty
type: Property
domain: Package
term status: stable

checksumAlgorithm blake3
type: ChecksumAlgorithm
type: Thing
type: NamedIndividual
comment: Indicates the algorithm used was BLAKE3.
term status: stable

Stract
type: Proposal
type: Project
proposal name: Stract
proposal status: Selected
proposal website: trystract.com
to fund: Entrust Fund

LibreCellular
type: RunningProject
type: Proposal
type: Project
proposal name: LibreCellular
proposal status: Running
proposal website: librecellular.org
to fund: Entrust Fund

SPARQL target
type: Class
comment: The class of targets that are based on SPARQL queries.
subclass of: Target
subclass of: SPARQL SELECT executable
subclass of: SPARQL ASK executable

postmarketOS/phosh-mobile-settings integration
type: RunningProject
type: Proposal
type: Project
proposal name: postmarketOS/phosh-mobile-settings integration
proposal status: Running
proposal website: https://gitlab.gnome.org/guidog/phosh-mobile-settings/-/issues/19
to fund: Core Fund

optional
type: Property
comment: Indicates whether a parameter is optional.
domain: Parameter

MinCountConstraintComponent-minCount
type: Shape
type: Property shape
type: Parameter
datatype: integer
max count: 1
path: min count

Dislike
type: Class
comment: The actor dislikes the object
subclass of: Activity

Conzept encyclopedia
type: CompletedProject
type: Proposal
type: Project
proposal name: Conzept encyclopedia
proposal status: Complete
proposal website: conze.pt
to fund: Discovery Fund

member
type: ObjectProperty
type: Property
comment: A license, or other licensing information, that is a member of the subject license set.
domain: Class
  unionOf: ConjunctiveLicenseSet
  unionOf: DisjunctiveLicenseSet
  unionOf: WithExceptionOperator
range: AnyLicenseInfo
term status: stable

checksumAlgorithm md5
type: ChecksumAlgorithm
type: Thing
type: NamedIndividual
comment: Indicates the algorithm used was MD5
term status: stable

pattern
type: Property
comment: Specifies a regular expression pattern that the string representations of the value nodes must match.

TrustING
type: CompletedProject
type: Proposal
type: Project
proposal name: TrustING
proposal status: Complete
proposal website: www.scion-architecture.net
to fund: Assure Fund

Date Available
type: Property
comment: Date that the resource became or will become available.
comment: Date (often a range) that the resource became or will become available.
subPropertyOf: Date
date: 2008-01-14
date: 2000-07-11
description: Recommended practice is to describe the date, date/time, or period of time as recommended for the property Date, of which this is a subproperty.
Relation: available-003
Has Version: available-003
issued: 2000-07-11
Date Modified: 2008-01-14

GPRS/EGPRS support in Osmocom CNI for Ericsson RBS
type: RunningProject
type: Proposal
type: Project
proposal name: GPRS/EGPRS support in Osmocom CNI for Ericsson RBS
proposal status: Running
proposal website: https://osmocom.org/issues/5198
to fund: UOI Fund

CryptPad
type: CompletedProject
type: Proposal
type: Project
proposal name: CryptPad
proposal status: Complete
proposal website: cryptpad.fr
to fund: PET Fund

EventFahrplan
type: RunningProject
type: Proposal
type: Project
proposal name: EventFahrplan
proposal status: Running
proposal website: eventfahrplan.eu
to fund: Entrust Fund

Flag
type: Class
comment: To flag something (e.g. flag as inappropriate, flag as spam, etc)
subclass of: Activity

CryptoLyzer
type: CompletedProject
type: Proposal
type: Project
proposal name: CryptoLyzer
proposal status: Complete
proposal website: cryptolyzer
to fund: Assure Fund

Role
type: Class
comment: En rolle er den funktion en ressource eller aktør har i forhold til en anden ressource, i forbindelse med ressourcekreditering eller ressourcerelationer. @da
comment: Un rol es la función de un recurso o agente con respecto a otro recuros, en el contexto de atribución del recurso o de las relaciones entre recursos. @es
comment: Un ruolo è la funzione di una risorsa o di un agente rispetto ad un'altra risorsa, nel contesto dell'attribuzione delle risorse o delle relazioni tra risorse. @it
comment: Role je funkce zdroje či agenta ve vztahu k jinému zdroji, v kontextu přiřazení zdrojů či vztahů mezi zdroji. @cs
comment: A role is the function of a resource or agent with respect to another resource, in the context of resource attribution or resource relationships.
label: Rolle @da
label: Rol @es
label: Ruolo @it
subclass of: Concept
change note: Nuova classe aggiunta in DCAT 2.0. @it
change note: New class added in DCAT 2.0.
change note: Nová třída přidaná ve verzi DCAT 2.0. @cs
change note: Nueva clase agregada en DCAT 2.0. @es
change note: Ny klasse tilføjet i DCAT 2.0.
editorial note: Přidáno do DCAT pro doplnění třídy prov:Role (jejíž užití je omezeno na role v kontextu aktivit, jakožto obor hodnot vlastnosti prov:hadRole). @cs
editorial note: Introduceret i DCAT for at supplere prov:Role (hvis anvendelse er begrænset til roller i forbindelse med en aktivitet, som er rækkevidde for prov:hadRole). @da
editorial note: Introduced into DCAT to complement prov:Role (whose use is limited to roles in the context of an activity, as the range of prov:hadRole).
editorial note: Introdotta in DCAT per completare prov:Role (il cui uso è limitato ai ruoli nel contesto di un'attività, in conseguenza alla definizione del codominio di prov:hadRole). @it
editorial note: Incluída en DCAT para complementar prov:Role (cuyo uso está limitado a roles en el contexto de una actividad, ya que es el rango es prov:hadRole). @es
scope note: Anvendes i forbindelse med kvalificerede krediteringer til at angive aktørens rolle i forhold til en entitet. Det anbefales at værdierne styres som et kontrolleret udfaldsrum med aktørroller, såsom http://registry.it.csiro.au/def/isotc211/CI_RoleCode. @da
scope note: Utilizzato in un'attribuzione qualificata per specificare il ruolo di un agente rispetto a un'entità. Si consiglia di attribuire i valori considerando un vocabolario controllato dei ruoli dell'agente, ad esempio http://registry.it.csiro.au/def/isotc211/CI_RoleCode. @it
scope note: Použito v kvalifikovaném přiřazení pro specifikaci role Agenta ve vztahu k Entitě. Je doporučeno množinu hodnot spravovat jako řízený slovník rolí agentů, jako například http://registry.it.csiro.au/def/isotc211/CI_RoleCode. @cs
scope note: Utilizzato in una relazione qualificata per specificare il ruolo di un'entità rispetto a un'altra entità. Si raccomanda che il valore sia preso da un vocabolario controllato di ruoli di entità come ISO 19115 DS_AssociationTypeCode http://registry.it.csiro.au/def/isotc211/DS_AssociationTypeCode, IANA Registry of Link Relations https://www.iana.org/assignments/link-relation, DataCite metadata schema, o MARC relators https://id.loc.gov/vocabulary/relators. @it
scope note: Se usa en una relación cualificada para especificar el rol de una Entidad con respecto a otra Entidad. Se recomienda que los valores se administren como los valores de un vocabulario controlado de roles de entidad como por ejemplo: ISO 19115 DS_AssociationTypeCode http://registry.it.csiro.au/def/isotc211/DS_AssociationTypeCode; IANA Registry of Link Relations https://www.iana.org/assignments/link-relation; el esquema de metadatos de DataCite; MARC relators https://id.loc.gov/vocabulary/relators. @es
scope note: Used in a qualified-attribution to specify the role of an Agent with respect to an Entity. It is recommended that the values be managed as a controlled vocabulary of agent roles, such as http://registry.it.csiro.au/def/isotc211/CI_RoleCode.
scope note: Použito v kvalifikovaném vztahu pro specifikaci role Entity ve vztahu k jiné Entitě. Je doporučeno množinu hodnot spravovat jako řízený slovník rolí entit, jako například ISO 19115 DS_AssociationTypeCode http://registry.it.csiro.au/def/isotc211/DS_AssociationTypeCode, IANA Registry of Link Relations https://www.iana.org/assignments/link-relation, DataCite metadata schema, či MARC relators https://id.loc.gov/vocabulary/relators. @cs
scope note: Used in a qualified-relation to specify the role of an Entity with respect to another Entity. It is recommended that the values be managed as a controlled vocabulary of entity roles such as: ISO 19115 DS_AssociationTypeCode http://registry.it.csiro.au/def/isotc211/DS_AssociationTypeCode; IANA Registry of Link Relations https://www.iana.org/assignments/link-relation; DataCite metadata schema; MARC relators https://id.loc.gov/vocabulary/relators.
scope note: Anvendes i forbindelse med kvalificerede relationer til at specificere en entitets rolle i forhold til en anden entitet. Det anbefales at værdierne styres med et kontrolleret udfaldsrum for for entitetsroller såsom: ISO 19115 DS_AssociationTypeCode http://registry.it.csiro.au/def/isotc211/DS_AssociationTypeCode; IANA Registry of Link Relations https://www.iana.org/assignments/link-relation; DataCite metadata schema; MARC relators https://id.loc.gov/vocabulary/relators. @da
scope note: Se usa en una atribución cualificada para especificar el rol de un Agente con respecto a una Entidad. Se recomienda que los valores se administren como un vocabulario controlado de roles de agente, como por ejemplo http://registry.it.csiro.au/def/isotc211/CI_RoleCode. @es

RFC 1766
type: Datatype
type: Class
comment: The set of tags, constructed according to RFC 1766, for the identification of languages.
date: 2000-07-11
date: 2008-01-14
Relation: RFC1766-003
Has Version: RFC1766-003
issued: 2000-07-11
Date Modified: 2008-01-14

landing page
type: Property
type: ObjectProperty
comment: Une page Web accessible par un navigateur Web donnant accès au catalogue, un jeu de données, ses distributions et/ou des informations additionnelles. @fr
comment: Webová stránka, na kterou lze pro získání přístupu ke katalogu, datové sadě, jejím distribucím a/nebo dalším informacím přistoupit webovým prohlížečem. @cs
comment: En webside som der kan navigeres til i en webbrowser for at få adgang til kataloget, et datasæt, dets distributioner og/eller yderligere information. @da
comment: صفحة وب يمكن من خلالها الوصول الى قائمة البيانات أو إلى معلومات إضافية متعلقة بها @ar
comment: データセット、その配信および（または）追加情報にアクセスするためにウエブ・ブラウザでナビゲートできるウェブページ。 @ja
comment: Una pagina web che può essere navigata per ottenere l'accesso al catalogo, ad un dataset, alle distribuzioni del dataset e/o ad informazioni addizionali. @it
comment: Μία ιστοσελίδα πλοηγίσιμη μέσω ενός φυλλομετρητή (Web browser) που δίνει πρόσβαση στο σύνολο δεδομένων, τις διανομές αυτού ή/και επιπρόσθετες πληροφορίες. @el
comment: A Web page that can be navigated to in a Web browser to gain access to the catalog, a dataset, its distributions and/or additional information.
comment: Una página web que puede ser visitada en un explorador Web para tener acceso el catálogo, un conjunto de datos, sus distribuciones y/o información adicional. @es
label: ιστοσελίδα αρχικής πρόσβασης @el
label: pagina di destinazione @it
label: صفحة وصول @ar
label: page d'atterrissage @fr
label: ランディング・ページ @ja
label: destinationsside @da
label: vstupní stránka @cs
label: página de destino @es
range: Document
subPropertyOf: page
definition: En webside som en webbrowser kan navigeres til for at få adgang til kataloget, et datasæt, dets distritbutioner og/eller yderligere information. @da
scope note: Si la distribution est seulement accessible à travers une page d'atterrissage (exple. pas de connaissance d'URLS de téléchargement direct ), alors le lien de la page d'atterrissage doit être dupliqué comme accessURL sur la distribution. @fr
scope note: Se la distribuzione è accessibile solo attraverso una pagina di destinazione (cioè, un URL di download diretto non è noto), il link alla pagina di destinazione deve essere duplicato come accessURL sulla distribuzione. @it
scope note: Pokud je distribuce dostupná pouze přes vstupní stránku, t.j. přímý URL odkaz ke stažení není znám, URL přístupové stránky by mělo být duplikováno ve vlastnosti distribuce accessURL. @cs
scope note: Αν η/οι διανομή/ές είναι προσβάσιμη/ες μόνο μέσω μίας ιστοσελίδας αρχικής πρόσβασης (δηλαδή αν δεν υπάρχουν γνωστές διευθύνσεις άμεσης μεταφόρτωσης), τότε ο σύνδεσμος της ιστοσελίδας αρχικής πρόσβασης πρέπει να αναπαραχθεί ως accessURL σε μία διανομή. @el
scope note: If the distribution(s) are accessible only through a landing page (i.e. direct download URLs are not known), then the landing page link should be duplicated as accessURL on a distribution.
scope note: ランディング・ページを通じてしか配信にアクセスできない場合（つまり、直接的なダウンロードURLが不明）には、配信におけるaccessURLとしてランディング・ページのリンクをコピーすべきです（SHOULD）。 @ja
scope note: Si la distribución es accesible solamente través de una página de aterrizaje (i.e., no se conoce una URL de descarga directa), entonces el enlance a la página de aterrizaje debe ser duplicado como accessURL sobre la distribución. @es
scope note: Hvis en eller flere distributioner kun er tilgængelige via en destinationsside (dvs. en URL til direkte download er ikke kendt), så bør destinationssidelinket gentages som adgangsadresse for en distribution. @da

Relation
type: Property
comment: A related resource.
subPropertyOf: Relation
date: 2008-01-14
description: Recommended best practice is to identify the related resource by means of a string conforming to a formal identification system.
description: Recommended practice is to identify the related resource by means of a URI. If this is not possible or feasible, a string conforming to a formal identification system may be provided.
Relation: relationT-001
Has Version: relationT-001
issued: 2008-01-14
Date Modified: 2008-01-14
note: This term is intended to be used with non-literal values as defined in the DCMI Abstract Model (http://dublincore.org/documents/abstract-model/). As of December 2007, the DCMI Usage Board is seeking a way to express this intention with a formal range declaration.

Castopod Plugins
type: Proposal
type: Project
proposal name: Castopod Plugins
proposal status: Selected
proposal website: castopod.org
to fund: Entrust Fund

RangeSelector
type: Class
comment: A Range Selector can be used to identify the beginning and the end of the selection by using other Selectors. The selection consists of everything from the beginning of the starting selector through to the beginning of the ending selector, but not including it.
subclass of: Selector

Discover and move your coins by yourself
type: CompletedProject
type: Proposal
type: Project
proposal name: Discover and move your coins by yourself
proposal status: Complete
proposal website: wallet
to fund: Discovery Fund

value
type: Property
comment: An RDF node that has caused the result.
domain: Abstract result

RelationshipType
type: Class
comment: Type of relationship.
term status: stable

unique languages
type: Property
comment: Specifies whether all node values must have a unique (or no) language tag.

referenceCategory packageManager
type: ReferenceCategory
type: Thing
type: NamedIndividual
term status: stable

Travel
type: Class
comment: The actor is traveling to the target. The origin specifies where the actor is traveling from.
subclass of: IntransitiveActivity

Creator
type: Property
comment: An entity primarily responsible for making the resource.
date: 1999-07-02
description: Examples of a Creator include a person, an organization, or a service. Typically, the name of a Creator should be used to indicate the entity.
issued: 1999-07-02
note: A [second property](/specifications/dublin-core/dcmi-terms/#http://purl.org/dc/terms/creator) with the same name as this property has been declared in the [dcterms: namespace](http://purl.org/dc/terms/). See the Introduction to the document [DCMI Metadata Terms](/specifications/dublin-core/dcmi-terms/) for an explanation.

GoatCounter
type: CompletedProject
type: Proposal
type: Project
proposal name: GoatCounter
proposal status: Complete
proposal website: www.goatcounter.com
to fund: PET Fund

maxCardinality
type: Property
comment: The property that determines the cardinality of a maximum cardinality restriction.
domain: Restriction

language in
type: Property
comment: Specifies a list of language tags that all value nodes must have.
range: List

Canaille
type: RunningProject
type: Proposal
type: Project
proposal name: Canaille
proposal status: Running
proposal website: canaille.yaal.coop
to fund: Entrust Fund

FileSender
type: CompletedProject
type: Proposal
type: Project
proposal name: FileSender
proposal status: Complete
proposal website: filesender.org
to fund: FileSender

Minedive
type: CompletedProject
type: Proposal
type: Project
proposal name: Minedive
proposal status: Complete
proposal website: wiki
to fund: Discovery Fund

Inventaire
type: CompletedProject
type: Proposal
type: Project
proposal name: Inventaire
proposal status: Complete
proposal website: inventaire.io
to fund: Discovery Fund

referenceType
type: ObjectProperty
type: Property
comment: Type of the external reference. These are definined in an appendix in the SPDX specification.
domain: ExternalRef
range: ReferenceType
term status: stable

download URL
type: Property
type: ObjectProperty
comment: رابط مباشر لملف يمكن تحميله. نوع الملف يتم توصيفه باستخدام الخاصية dct:format dcat:mediaType @ar
comment: Είναι ένας σύνδεσμος άμεσης μεταφόρτωσης ενός αρχείου σε μια δεδομένη μορφή. Π.χ. ένα αρχείο CSV ή RDF. Η μορφη αρχείου περιγράφεται από τις ιδιότητες dct:format ή/και dcat:mediaType της διανομής. @el
comment: dcat:downloadURLはdcat:accessURLの特定の形式です。しかし、DCATプロファイルが非ダウンロード・ロケーションに対してのみaccessURLを用いる場合には、より強い分離を課すことを望む可能性があるため、この含意を強化しないように、DCATは、dcat:downloadURLをdcat:accessURLのサブプロパティーであると定義しません。 @ja
comment: URL souboru ke stažení v daném formátu, například CSV nebo RDF soubor. Formát je popsán vlastností distribuce dct:format a/nebo dcat:mediaType. @cs
comment: Questo è un link diretto al file scaricabile in un dato formato. E.g. un file CSV o un file RDF. Il formato è descritto dal dct:format e/o dal dcat:mediaType della distribuzione. @it
comment: La URL de un archivo descargable en el formato dato. Por ejemplo, archivo CSV o archivo RDF. El formato se describe con las propiedades de la distribución dct:format y/o dcat:mediaType. @es
comment: Ceci est un lien direct à un fichier téléchargeable en un format donnée. Exple fichier CSV ou RDF. Le format est décrit par les propriétés de distribution dct:format et/ou dcat:mediaType. @fr
comment: The URL of the downloadable file in a given format. E.g. CSV file or RDF file. The format is indicated by the distribution's dct:format and/or dcat:mediaType.
comment: URL til fil der kan downloades i et bestemt format. Fx en CSV-fil eller en RDF-fil. Formatet for distributionen angives ved hjælp af egenskaberne dct:format og/eller dcat:mediaType. @da
domain: Distribution
label: URL de téléchargement @fr
label: URL μεταφόρτωσης @el
label: URL souboru ke stažení @cs
label: URL di scarico @it
label: ダウンロードURL @ja
label: رابط تحميل @ar
label: URL de descarga @es
label: downloadURL @da
editorial note: rdfs:label, rdfs:comment and/or skos:scopeNote have been modified. Non-english versions must be updated.
editorial note: Status: English Definition text modified by DCAT revision team, Italian, Spanish and Czech translation updated, other translations pending.
scope note: Η τιμή είναι ένα URL. @el
scope note: dcat:downloadURL BØR anvendes til angivelse af den adresse hvor distributionen er tilgængelig direkte, typisk gennem et HTTP Get request. @da
scope note: El valor es una URL. @es
scope note: dcat:downloadURL DOVREBBE essere utilizzato per l'indirizzo a cui questa distribuzione è disponibile direttamente, in genere attraverso una richiesta Get HTTP. @it
scope note: dcat:downloadURL BY MĚLA být použita pro adresu, ze které je distribuce přímo přístupná, typicky skrze požadavek HTTP Get. @cs
scope note: dcat:downloadURL SHOULD be used for the address at which this distribution is available directly, typically through a HTTP Get request.
scope note: La valeur est une URL. @fr

peermaps
type: CompletedProject
type: Proposal
type: Project
proposal name: peermaps
proposal status: Complete
proposal website: peermaps.org
to fund: Discovery Fund

relationshipType exampleOf
type: RelationshipType
type: Thing
type: NamedIndividual
comment: Is to be used when SPDXRef-A is an example of SPDXRef-B.
term status: stable

snippetName
type: Property
type: DatatypeProperty
comment: Identify a specific snippet in a human convenient manner.
domain: Snippet
subPropertyOf: name
term status: stable

NaxRiscv core improvements
type: RunningProject
type: Proposal
type: Project
proposal name: NaxRiscv core improvements
proposal status: Running
proposal website: NaxRiscv
to fund: Entrust Fund

Mobilizon
type: CompletedProject
type: Proposal
type: Project
proposal name: Mobilizon
proposal status: Complete
proposal website: joinmobilizon.org
to fund: Discovery Fund

provideClientKey
type: FunctionalProperty
type: Property
type: ObjectProperty
comment: If Linked Data Signatures and HTTP Signatures are being used for authentication and authorization, this endpoint specifies a URI at which browser-authenticated users may authorize a client's public key for client to server interactions.
domain: Actor

Holo Routing
type: Proposal
type: Project
proposal name: Holo Routing
proposal status: Selected
proposal website: holo
to fund: Core Fund

ConjunctiveLicenseSet
type: Class
comment: A ConjunctiveLicenseSet represents a set of licensing information all of which apply.
subclass of: AnyLicenseInfo
subclass of: Container
subclass of: Class
  type: Restriction
  minQualifiedCardinality: 2
  onClass: AnyLicenseInfo
  onProperty: member
term status: stable

Linguistic System
type: Class
comment: A system of signs, symbols, sounds, gestures, or rules used in communication.
date: 2008-01-14
description: Written, spoken, sign, and computer languages are linguistic systems.
description: Examples include written, spoken, sign, and computer languages.
Relation: LinguisticSystem-001
Has Version: LinguisticSystem-001
issued: 2008-01-14

intersection
type: Property
comment: A list of node expressions that shall be intersected.

Has-value constraint component
type: Parameterizable
type: Constraint component
comment: A constraint component that can be used to verify that one of the value nodes is a given RDF node.
parameter: HasValueConstraintComponent-hasValue

target subjects of
type: Property
comment: Links a shape to a property, indicating that all subjects of triples that have the given property as their predicate must conform to the shape.
domain: Shape
range: Property

Cryptech
type: Proposal
type: Project
proposal name: Cryptech
proposal status: Selected
proposal website: cryptech.is
to fund: Cryptech

inbox
type: FunctionalProperty
type: ObjectProperty
type: Property
comment: The object's activity inbox containing all activities received by the actor (reverse-chronological order)
domain: Object
range: OrderedActivityCollection

target
type: Property
type: ObjectProperty
comment: Describes the indirect object, or target, of the activity. The precise meaning of the target is largely dependent on the type of action being described but will often be the object of the English preposition "to". For instance, in the activity "John added a movie to his wishlist", the target of the activity is John's wishlist. An activity can have more than one target.
domain: Activity
range: Class
  unionOf: Object
  unionOf: Link

XWiki ActivityPub
type: CompletedProject
type: Proposal
type: Project
proposal name: XWiki ActivityPub
proposal status: Complete
proposal website: xwiki.org
to fund: Discovery Fund

maxQualifiedCardinality
type: Property
comment: The property that determines the cardinality of a maximum qualified cardinality restriction.
domain: Restriction

LibreOffice/Collabora Online typography
type: RunningProject
type: Proposal
type: Project
proposal name: LibreOffice/Collabora Online typography
proposal status: Running
proposal website: typography
to fund: Entrust Fund

Verilog-AMS in Gnucap (cont'd)
type: RunningProject
type: Proposal
type: Project
proposal name: Verilog-AMS in Gnucap (cont'd)
proposal status: Running
proposal website: gnucap.org
to fund: Entrust Fund

Method of Accrual
type: Class
comment: A method by which resources are added to a collection.
date: 2008-01-14
Relation: MethodOfAccrual-001
Has Version: MethodOfAccrual-001
issued: 2008-01-14

topObjectProperty
type: Property
type: ObjectProperty
comment: The object property that relates every two individuals.
domain: Thing
range: Thing

assessing
type: Concept
type: Motivation
comment: The motivation for when the user intends to provide an assessment about the Target resource.

LunaPnR Phase 2
type: RunningProject
type: Proposal
type: Project
proposal name: LunaPnR Phase 2
proposal status: Running
proposal website: www.asicsforthemasses.com
to fund: Entrust Fund

John Erickson
type: Agent

Direction
type: Class
comment: A class to encapsulate the different text directions that a textual resource might take. It is not used directly in the Annotation Model, only its three instances.

IRI or literal
type: Node kind
comment: The node kind of all IRIs or literals.

totalItems
type: FunctionalProperty
type: Property
type: DatatypeProperty
comment: The total number of items in a logical collection
domain: Collection

relatedSpdxElement
type: ObjectProperty
type: Property
comment: A related SpdxElement.
domain: Relationship
range: SpdxElement
term status: stable

URL Frontier
type: CompletedProject
type: Proposal
type: Project
proposal name: URL Frontier
proposal status: Complete
proposal website: url-frontier
to fund: Discovery Fund

Validation report
type: Class
comment: The class of SHACL validation reports.
subclass of: Resource

Luna PnR
type: Proposal
type: Project
proposal name: Luna PnR
proposal status: Selected
proposal website: www.asicsforthemasses.com
to fund: PET Fund

References
type: Property
comment: A related resource that is referenced, cited, or otherwise pointed to by the described resource.
subPropertyOf: Relation
date: 2008-01-14
date: 2000-07-11
description: This property is intended to be used with non-literal values. This property is an inverse property of Is Referenced By.
Relation: references-003
Has Version: references-003
issued: 2000-07-11
Date Modified: 2008-01-14
note: This term is intended to be used with non-literal values as defined in the DCMI Abstract Model (http://dublincore.org/documents/abstract-model/). As of December 2007, the DCMI Usage Board is seeking a way to express this intention with a formal range declaration.

referenceCategory persistentId
type: ReferenceCategory
type: Thing
type: NamedIndividual
comment: These point to objects present in the Software Heritage archive by the means of persistent identifiers that are guaranteed to remain stable (persistent) over time.
term status: stable

EDeA
type: RunningProject
type: Proposal
type: Project
proposal name: EDeA
proposal status: Running
proposal website: blog.edea.dev
to fund: Entrust Fund

MaxInclusiveConstraintComponent-maxInclusive
type: Shape
type: Property shape
type: Parameter
max count: 1
node kind: Literal
path: max inclusive

max length
type: Property
comment: Specifies the maximum string length of each value node.

Improving the deployability of Multipath TCP
type: RunningProject
type: Proposal
type: Project
proposal name: Improving the deployability of Multipath TCP
proposal status: Running
proposal website: mptcp.dev
to fund: Core Fund

NoScript Contextual Policies & LAN protection
type: Proposal
type: Project
proposal name: NoScript Contextual Policies & LAN protection
proposal status: Selected
proposal website: noscript.net
to fund: PET Fund

neuropil
type: CompletedProject
type: Proposal
type: Project
proposal name: neuropil
proposal status: Complete
proposal website: www.neuropil.org
to fund: Discovery Fund

Fadi Maali
type: Agent

searx
type: CompletedProject
type: Proposal
type: Project
proposal name: searx
proposal status: Complete
proposal website: searx
to fund: Discovery Fund

Trenchboot as Anti Evil Maid
type: RunningProject
type: Proposal
type: Project
proposal name: Trenchboot as Anti Evil Maid
proposal status: Running
proposal website: trenchboot-aem-v2
to fund: Entrust Fund

GNU Taler KYC
type: RunningProject
type: Proposal
type: Project
proposal name: GNU Taler KYC
proposal status: Running
proposal website: taler.net
to fund: Assure Fund

Instructional Method
type: Property
comment: A process, used to engender knowledge, attitudes and skills, that the described resource is designed to support.
range: Method of Instruction
range includes: Method of Instruction
date: 2008-01-14
date: 2005-06-13
description: Instructional Method typically includes ways of presenting instructional materials or conducting instructional activities, patterns of learner-to-learner and learner-to-instructor interactions, and mechanisms by which group and individual levels of learning are measured. Instructional methods include all aspects of the instruction and learning processes from planning and implementation through evaluation and feedback.
description: Instructional Method will typically include ways of presenting instructional materials or conducting instructional activities, patterns of learner-to-learner and learner-to-instructor interactions, and mechanisms by which group and individual levels of learning are measured. Instructional methods include all aspects of the instruction and learning processes from planning and implementation through evaluation and feedback.
Relation: instructionalMethod-002
Has Version: instructionalMethod-002
issued: 2005-06-13
Date Modified: 2008-01-14

Flarum
type: RunningProject
type: Proposal
type: Project
proposal name: Flarum
proposal status: Running
proposal website: flarum.org
to fund: Entrust Fund

Distributed Mechanism Learning
type: RunningProject
type: Proposal
type: Project
proposal name: Distributed Mechanism Learning
proposal status: Running
proposal website: dist-mech-learn
to fund: Assure Fund

backwardCompatibleWith
type: AnnotationProperty
type: OntologyProperty
type: Property
comment: The annotation property that indicates that a given ontology is backward compatible with another ontology.
domain: Ontology
range: Ontology

minCardinality
type: Property
comment: The property that determines the cardinality of a minimum cardinality restriction.
domain: Restriction

Collection
type: Class
comment: An ordered or unordered collection of Objects or Links
subclass of: Object

annotationType
type: ObjectProperty
type: Property
comment: Type of the annotation.
domain: Annotation
range: Class
  unionOf: Class
    type: Restriction
    hasValue: annotationType other
    onProperty: annotationType
  unionOf: Class
    type: Restriction
    hasValue: annotationType review
    onProperty: annotationType
term status: stable

OrderedActivityCollection
type: Class
comment: A collection of Activities.
subclass of: OrderedCollection
subclass of: Class
  type: Restriction
  onProperty: orderedItems
  someValuesFrom: Activity

Castopod
type: CompletedProject
type: Proposal
type: Project
proposal name: Castopod
proposal status: Complete
proposal website: castopod.org
to fund: Discovery Fund

Maemo Leste
type: Proposal
type: Project
proposal name: Maemo Leste
proposal status: Selected
proposal website: maemo-leste.github.io
to fund: PET Fund

targetIndividual
type: Property
comment: The property that determines the object of a negative object property assertion.
domain: NegativePropertyAssertion
range: Thing

Rights
type: Property
comment: Information about rights held in and over the resource.
date: 1999-07-02
description: Typically, rights information includes a statement about various property rights associated with the resource, including intellectual property rights.
issued: 1999-07-02
note: A [second property](/specifications/dublin-core/dcmi-terms/#http://purl.org/dc/terms/rights) with the same name as this property has been declared in the [dcterms: namespace](http://purl.org/dc/terms/). See the Introduction to the document [DCMI Metadata Terms](/specifications/dublin-core/dcmi-terms/) for an explanation.

property
type: Property
comment: Links a shape to its property shapes.
domain: Shape
range: Property shape

Mepo
type: CompletedProject
type: Proposal
type: Project
proposal name: Mepo
proposal status: Complete
proposal website: mepo
to fund: Discovery Fund

SPARQL UPDATE executable
type: Class
comment: The class of SPARQL executables based on a SPARQL UPDATE.
subclass of: SPARQL executable

OffsetPointer
type: Class
subclass of: SinglePointer
term status: stable

bto
type: Property
type: ObjectProperty
comment: Identifies an Object that is part of the private primary audience of this Object.
domain: Object
range: Class
  unionOf: Object
  unionOf: Link

ArtistHub
type: Proposal
type: Project
proposal name: ArtistHub
proposal status: Selected
proposal website: www.creativepassport.net
to fund: Discovery Fund

Storing Efficiently Our Software Heritage
type: CompletedProject
type: Proposal
type: Project
proposal name: Storing Efficiently Our Software Heritage
proposal status: Complete
proposal website: A practical approach to efficiently store 100 billions small objects in Ceph
to fund: Discovery Fund

eduVPN app
type: CompletedProject
type: Proposal
type: Project
proposal name: eduVPN app
proposal status: Complete
proposal website: www.eduvpn.org
to fund: VPN Fund

FileSender System Improvements
type: CompletedProject
type: Proposal
type: Project
proposal name: FileSender System Improvements
proposal status: Complete
proposal website: filesender.org
to fund: FileSender

NLnet ontology 0.1
type: Ontology
comment: NLnet ontology for proposals and projects
description: This ontology describes proposals sent to NLnet and project that result from those proposals.

direction
type: Property
comment: The base direction component of a CompoundLiteral.
domain: CompoundLiteral

Nym Credentials
type: CompletedProject
type: Proposal
type: Project
proposal name: Nym Credentials
proposal status: Complete
proposal website: nymtech.net
to fund: PET Fund

Andrea Perego
type: Agent

filesAnalyzed
type: DatatypeProperty
type: Property
comment: Indicates whether the file content of this package has been available for or subjected to analysis when creating the SPDX document. If false indicates packages that represent metadata or URI references to a project, product, artifact, distribution or a component. If set to false, the package must not contain any files.
domain: Package
term status: stable

SPARQL constraint
type: Class
comment: The class of constraints based on SPARQL SELECT queries.
subclass of: SPARQL SELECT executable

order
type: DatatypeProperty
type: Property
comment: The ordinal order of this element within a list
domain: CrossRef

relationshipType requirementDescriptionFor
type: RelationshipType
type: Thing
type: NamedIndividual
comment: Is to be used when SPDXRef-A describes, illustrates, or specifies a requirement statement for SPDXRef-B.
term status: stable

annotationType review
type: AnnotationType
type: Thing
type: NamedIndividual
comment: A Review represents an audit and signoff by an individual, organization or tool on the information for an SpdxElement.
term status: stable

DataRange
type: Class
comment: The class of OWL data ranges, which are special kinds of datatypes. Note: The use of the IRI owl:DataRange has been deprecated as of OWL 2. The IRI rdfs:Datatype SHOULD be used instead.
subclass of: Datatype

Alejandra Gonzalez-Beltran
type: Agent
affiliation: Science and Technology Facilities Council, UK

Manas
type: Proposal
type: Project
proposal name: Manas
proposal status: Selected
proposal website: manas
to fund: Entrust Fund

likes
type: Property
type: ObjectProperty
comment: Every object MAY have a likes collection. This is a list of all Like activities with this object as the object property
domain: Object
range: Class
  unionOf: OrderedActivityCollection
  unionOf: ActivityCollection

Phil Archer
type: Agent
affiliation: W3C

CompoundLiteral
type: Class
comment: A class representing a compound literal.
subclass of: Resource

Automating mobile app interception with Frida
type: RunningProject
type: Proposal
type: Project
proposal name: Automating mobile app interception with Frida
proposal status: Running
proposal website: httptoolkit.tech
to fund: Entrust Fund

Constraint component
type: Class
comment: The class of constraint components.
subclass of: Parameterizable

Heads-OpenPGP
type: RunningProject
type: Proposal
type: Project
proposal name: Heads-OpenPGP
proposal status: Running
proposal website: insurgo.ca
to fund: Assure Fund

mitmproxy
type: RunningProject
type: Proposal
type: Project
proposal name: mitmproxy
proposal status: Running
proposal website: mitmproxy.org
to fund: Entrust Fund

reviewed
type: Property
type: ObjectProperty
type: Thing
type: NamedIndividual
comment: This property has been deprecated since SPDX version 2.0. It has been replaced by an Annotation with an annotation type review.
comment: Reviewed
domain: SpdxDocument
range: Review
deprecated: true
term status: deprecated

Relation
type: Property
comment: A related resource.
date: 1999-07-02
description: Recommended practice is to identify the related resource by means of a URI. If this is not possible or feasible, a string conforming to a formal identification system may be provided.
issued: 1999-07-02
note: A [second property](/specifications/dublin-core/dcmi-terms/#http://purl.org/dc/terms/relation) with the same name as this property has been declared in the [dcterms: namespace](http://purl.org/dc/terms/). See the Introduction to the document [DCMI Metadata Terms](/specifications/dublin-core/dcmi-terms/) for an explanation.

GNS Migration and Zone Management
type: RunningProject
type: Proposal
type: Project
proposal name: GNS Migration and Zone Management
proposal status: Running
proposal website: gns
to fund: Entrust Fund

ActorCollection
type: Class
comment: A collection of Actors.
subclass of: Collection
subclass of: Class
  type: Restriction
  onProperty: items
  someValuesFrom: Actor

refinedBy
type: Property
comment: The relationship between a Selector and another Selector or a State and a Selector or State that should be applied to the results of the first to refine the processing of the source resource.

OCaml-QUIC
type: Proposal
type: Project
proposal name: OCaml-QUIC
proposal status: Selected
proposal website: ocaml-quic
to fund: Core Fund

Open Call
fund label: Open Call
fund status: Open
proposals accepted: 1
proposals submitted: 304

eduVPN multi-protocol
type: Proposal
type: Project
proposal name: eduVPN multi-protocol
proposal status: Selected
proposal website: www.eduvpn.org
proposal website: www.wireguard.com
to fund: VPN Fund

langString
type: Class
type: Datatype
comment: The datatype of language-tagged string values
subclass of: Literal

Form Tester
type: Proposal
type: Project
proposal name: Form Tester
proposal status: Selected
proposal website: nlnet.nl
to fund: Other

Rufus Pollock
type: Agent
affiliation: Open Knowledge Foundation

Modular Meta-Press.es
type: RunningProject
type: Proposal
type: Project
proposal name: Modular Meta-Press.es
proposal status: Running
proposal website: meta-press.es
to fund: Entrust Fund

items
type: ObjectProperty
type: Property
comment: Identifies the items contained in a collection. The items might be ordered or unordered.
domain: Collection
range: Class
  unionOf: Class
    unionOf: Object
    unionOf: Link
  unionOf: OrderedItems

Blank node or literal
type: Node kind
comment: The node kind of all blank nodes or literals.

standardLicenseHeader
type: DatatypeProperty
type: Property
comment: License author's preferred text to indicated that a file is covered by the license.
domain: License
term status: stable

Adding TPM Support to Sequoia PGP
type: CompletedProject
type: Proposal
type: Project
proposal name: Adding TPM Support to Sequoia PGP
proposal status: Complete
proposal website: sequoia-pgp.org
to fund: Assure Fund

Libre-SOC Formal Correctness Proofs
type: Proposal
type: Project
proposal name: Libre-SOC Formal Correctness Proofs
proposal status: Selected
proposal website: nlnet 2019 formal
to fund: PET Fund

purpose device
type: Purpose
type: Thing
type: NamedIndividual
comment: The package refers to a chipset, processor, or electronic board.
term status: stable

Makx Dekkers
type: Agent

Event Federation Plugin for WordPress
type: RunningProject
type: Proposal
type: Project
proposal name: Event Federation Plugin for WordPress
proposal status: Running
proposal website: projects
to fund: Entrust Fund

Like
type: Class
comment: To Like Something
subclass of: Activity

checksumAlgorithm sha3 512
type: ChecksumAlgorithm
type: Thing
type: NamedIndividual
comment: Indicates the algorithm used was SHA3-512.
term status: stable

equivalentClass
type: Property
comment: The property that determines that two given classes are equivalent, and that is used to specify datatype definitions.
domain: Class
range: Class

Etebase - protocol and encryption enhancements
type: Proposal
type: Project
proposal name: Etebase - protocol and encryption enhancements
proposal status: Selected
proposal website: www.etesync.com
to fund: PET Fund

reference
type: ObjectProperty
type: Property
domain: SinglePointer
term status: stable

RADIUSdesk
type: RunningProject
type: Proposal
type: Project
proposal name: RADIUSdesk
proposal status: Running
proposal website: radiusdesk.com
to fund: UOI Fund

Peppol for the masses
type: CompletedProject
type: Proposal
type: Project
proposal name: Peppol for the masses
proposal status: Complete
proposal website: peppol-python
to fund: Assure Fund

versionInfo
type: DatatypeProperty
type: Property
comment: Provides an indication of the version of the package that is described by this SpdxDocument.
domain: Package
term status: stable

Source
type: Property
comment: A related resource from which the described resource is derived.
date: 1999-07-02
description: The described resource may be derived from the related resource in whole or in part. Recommended best practice is to identify the related resource by means of a string conforming to a formal identification system.
issued: 1999-07-02
note: A [second property](/specifications/dublin-core/dcmi-terms/#http://purl.org/dc/terms/source) with the same name as this property has been declared in the [dcterms: namespace](http://purl.org/dc/terms/). See the Introduction to the document [DCMI Metadata Terms](/specifications/dublin-core/dcmi-terms/) for an explanation.

NeoChat
type: RunningProject
type: Proposal
type: Project
proposal name: NeoChat
proposal status: Running
proposal website: neochat
to fund: Assure Fund

Stencila v2 for ERA and EPP
type: Proposal
type: Project
proposal name: Stencila v2 for ERA and EPP
proposal status: Selected
proposal website: stenci.la
proposal website: elifesciences.org
to fund: Core Fund

Is Part Of
type: Property
comment: A related resource in which the described resource is physically or logically included.
subPropertyOf: Relation
date: 2008-01-14
date: 2000-07-11
description: This property is intended to be used with non-literal values. This property is an inverse property of Has Part.
Relation: isPartOf-003
Has Version: isPartOf-003
issued: 2000-07-11
Date Modified: 2008-01-14
note: This term is intended to be used with non-literal values as defined in the DCMI Abstract Model (http://dublincore.org/documents/abstract-model/). As of December 2007, the DCMI Usage Board is seeking a way to express this intention with a formal range declaration.

neuropil
type: RunningProject
type: Proposal
type: Project
proposal name: neuropil
proposal status: Running
proposal website: www.neuropil.org
to fund: Assure Fund

Karrot
type: CompletedProject
type: Proposal
type: Project
proposal name: Karrot
proposal status: Complete
proposal website: welcome
to fund: Discovery Fund

InverseFunctionalProperty
type: Class
comment: The class of inverse-functional properties.
subclass of: ObjectProperty

fileName
type: DatatypeProperty
type: Property
comment: The name of the file relative to the root of the package.
domain: File
subPropertyOf: name
term status: stable

FileSender Security and UI testing
type: Proposal
type: Project
proposal name: FileSender Security and UI testing
proposal status: Selected
proposal website: filesender.org
to fund: FileSender

elRepo.io - Resilient, distributed content sharing
type: Project
type: Proposal
proposal name: elRepo.io - Resilient, distributed content sharing
proposal status: Selected
proposal website: altermundi.net
proposal website: elrepo.io
proposal website: nethood.org
to fund: Discovery Fund

Kazarma
type: Proposal
type: Project
proposal name: Kazarma
proposal status: Selected
proposal website: kazarma
to fund: Discovery Fund

Haketilo/Hydrilla
type: CompletedProject
type: Proposal
type: Project
proposal name: Haketilo/Hydrilla
proposal status: Complete
proposal website: wiki
to fund: Discovery Fund

result
type: Property
type: ObjectProperty
comment: Describes the result of the activity. For instance, if a particular action results in the creation of a new resource, the result property can be used to describe that new resource.
domain: Activity
range: Class
  unionOf: Object
  unionOf: Link

ISO 639-3
type: Datatype
type: Class
comment: The set of three-letter codes listed in ISO 639-3 for the representation of names of languages.
date: 2008-01-14
Relation: ISO639-3-001
Has Version: ISO639-3-001
issued: 2008-01-14

Organization
type: Class
comment: An Organization
subclass of: Object

lineNumber
type: DatatypeProperty
type: Property
domain: LineCharPointer
range: positiveInteger
term status: stable

Libre-SOC Cavatools: Power ISA Simulator
type: RunningProject
type: Proposal
type: Project
proposal name: Libre-SOC Cavatools: Power ISA Simulator
proposal status: Running
proposal website: libre-soc.org
to fund: Assure Fund

Solid Control
type: CompletedProject
type: Proposal
type: Project
proposal name: Solid Control
proposal status: Complete
proposal website: wac-ucr
to fund: PET Fund

Qualified-max-count constraint component
type: Parameterizable
type: Constraint component
comment: A constraint component that can be used to verify that a specified maximum number of value nodes conforms to a given shape.
parameter: QualifiedMaxCountConstraintComponent-qualifiedValueShapesDisjoint
parameter: QualifiedMaxCountConstraintComponent-qualifiedValueShape
parameter: QualifiedMaxCountConstraintComponent-qualifiedMaxCount

annotator
type: DatatypeProperty
type: Property
comment: This field identifies the person, organization, or tool that has commented on a file, package, snippet, or the entire document.
domain: Annotation
term status: stable

licenseId
type: Property
type: DatatypeProperty
comment: A human readable short form license identifier for a license. The license ID is either on the standard license list or the form "LicenseRef-[idString]" where [idString] is a unique string containing letters, numbers, "." or "-". When used within a license expression, the license ID can optionally include a reference to an external document in the form "DocumentRef-[docrefIdString]:LicenseRef-[idString]" where docRefIdString is an ID for an external document reference.
domain: SimpleLicensingInfo
term status: stable

Sylk chat
type: CompletedProject
type: Proposal
type: Project
proposal name: Sylk chat
proposal status: Complete
proposal website: sylkserver.com
to fund: PET Fund

SpdxDocument
type: Class
comment: An SpdxDocument is a summary of the contents, provenance, ownership and licensing analysis of a specific software package. This is, effectively, the top level of SPDX information.
subclass of: SpdxElement
subclass of: Class
  type: Restriction
  minQualifiedCardinality: 0
  onClass: Package
  onProperty: describesPackage
subclass of: Class
  type: Restriction
  hasValue: CC0-1.0
  onProperty: dataLicense
subclass of: Class
  type: Restriction
  onDataRange: string
  onProperty: specVersion
  qualifiedCardinality: 1
subclass of: Class
  type: Restriction
  onClass: AnyLicenseInfo
  onProperty: dataLicense
  qualifiedCardinality: 1
subclass of: Class
  type: Restriction
  minQualifiedCardinality: 0
  onClass: ExtractedLicensingInfo
  onProperty: hasExtractedLicensingInfo
subclass of: Class
  type: Restriction
  minQualifiedCardinality: 0
  onClass: ExternalDocumentRef
  onProperty: externalDocumentRef
subclass of: Class
  type: Restriction
  onClass: CreationInfo
  onProperty: creationInfo
  qualifiedCardinality: 1
subclass of: Class
  type: Restriction
  minQualifiedCardinality: 0
  onClass: Review
  onProperty: reviewed
term status: stable

Media Type
type: Class
comment: A file format or physical medium.
subclass of: Media Type or Extent
date: 2008-01-14
Relation: MediaType-001
Has Version: MediaType-001
issued: 2008-01-14

Nitter
type: Proposal
type: Project
proposal name: Nitter
proposal status: Selected
proposal website: nitter
to fund: Entrust Fund

originator
type: DatatypeProperty
type: Property
comment: The name and, optionally, contact information of the person or organization that originally created the package. Values of this property must conform to the agent and tool syntax.
domain: Package

LibreCellular
type: CompletedProject
type: Proposal
type: Project
proposal name: LibreCellular
proposal status: Complete
proposal website: abopen.com
to fund: PET Fund

BBBsecureChat
type: CompletedProject
type: Proposal
type: Project
proposal name: BBBsecureChat
proposal status: Complete
proposal website: fairkom.eu
to fund: PET Fund

generator
type: Property
type: ObjectProperty
comment: Identifies the entity (e.g. an application) that generated the object.
domain: Object
range: Class
  unionOf: Object
  unionOf: Link

relationshipType buildToolOf
type: RelationshipType
type: Thing
type: NamedIndividual
comment: To be used when SPDXRef-A is used to to build SPDXRef-B.
term status: stable

Icestudio
type: Proposal
type: Project
proposal name: Icestudio
proposal status: Selected
proposal website: icestudio.io
to fund: Entrust Fund

SARS-CoV2 Fund
fund label: CoV2-Fund
fund status: Open
proposals accepted: 1
proposals submitted: 1

Funkwhale
type: Proposal
type: Project
proposal name: Funkwhale
proposal status: Selected
proposal website: funkwhale.audio
to fund: Discovery Fund

Mobilizon UX
type: RunningProject
type: Proposal
type: Project
proposal name: Mobilizon UX
proposal status: Running
proposal website: fr
to fund: Core Fund

DisjunctiveLicenseSet
type: Class
comment: A DisjunctiveLicenseSet represents a set of licensing information where only one license applies at a time. This class implies that the recipient gets to choose one of these licenses they would prefer to use.
subclass of: AnyLicenseInfo
subclass of: Container
subclass of: Class
  type: Restriction
  minQualifiedCardinality: 2
  onClass: AnyLicenseInfo
  onProperty: member
term status: stable

preferredUsername
type: FunctionalProperty
type: Property
type: DatatypeProperty
comment: A short username which may be used to refer to the actor, with no uniqueness guarantees.
domain: Actor

seeAlso
type: DatatypeProperty
type: Property
comment: Further information about the subject resource.
domain: Resource

Winden/Magic Wormhole dilation
type: RunningProject
type: Proposal
type: Project
proposal name: Winden/Magic Wormhole dilation
proposal status: Running
proposal website: winden
to fund: Assure Fund

eduVPN WireGuard edition
type: CompletedProject
type: Proposal
type: Project
proposal name: eduVPN WireGuard edition
proposal status: Complete
proposal website: www.eduvpn.org
to fund: VPN Fund

OSF Crawler Cooperation
type: CompletedProject
type: Proposal
type: Project
proposal name: OSF Crawler Cooperation
proposal status: Complete
proposal website: opensearchfoundation.org
to fund: Discovery Fund

GNU Mes on ARM
type: CompletedProject
type: Proposal
type: Project
proposal name: GNU Mes on ARM
proposal status: Complete
proposal website: mes.html
to fund: PET Fund

replies
type: Property
type: ObjectProperty
comment: Identifies a Collection containing objects considered to be responses to this object.
domain: Object
range: Collection

Kaidan A/V
type: CompletedProject
type: Proposal
type: Project
proposal name: Kaidan A/V
proposal status: Complete
proposal website: kaidan.im
to fund: PET Fund

SecuShare
type: Proposal
type: Project
proposal name: SecuShare
proposal status: Selected
proposal website: p2pcollab.net
to fund: InternetHardeningFund

NamedIndividual
type: Class
comment: The class of named individuals.
subclass of: Thing

f8
type: Proposal
type: Project
proposal name: f8
proposal status: Selected
proposal website: sdcc.sourceforge.net
to fund: Core Fund

Verilog-AMS in Gnucap
type: RunningProject
type: Proposal
type: Project
proposal name: Verilog-AMS in Gnucap
proposal status: Running
proposal website: gnucap.org
to fund: Entrust Fund

rule
type: Property
comment: The rules linked to a shape.
domain: Shape
range: Rule

Solid Usable App Tools Project
type: RunningProject
type: Proposal
type: Project
proposal name: Solid Usable App Tools Project
proposal status: Running
proposal website: o-development
to fund: Entrust Fund

Wispwot
type: RunningProject
type: Proposal
type: Project
proposal name: Wispwot
proposal status: Running
proposal website: wispwot
to fund: Assure Fund

end date
type: DatatypeProperty
type: Property
domain: Period of Time
label: fecha final @es
label: slutdato @da
label: datum konce @cs
label: data di fine @it
alternative label: sluttidspunkt @da
change note: Ny egenskab i DCAT 2.0. @da
change note: Nuova proprietà aggiunta in DCAT 2.0. @it
change note: Nová vlastnost přidaná ve verzi DCAT 2.0. @cs
change note: Nueva propiedad agregada en DCAT 2.0. @es
change note: New property added in DCAT 2.0.
definition: The end of the period.
definition: Konec doby trvání. @cs
definition: La fine del periodo. @it
definition: Slutningen på perioden. @da
definition: El fin del período. @es
scope note: The range of this property is intentionally generic, with the purpose of allowing different level of temporal precision for specifying the end of a period. E.g., it can be expressed with a date (xsd:date), a date and time (xsd:dateTime), or a year (xsd:gYear).
scope note: El rango de esta propiedad es intencionalmente genérico con el propósito de permitir distintos niveles de precisión temporal para especificar el fin del período. Por ejemplo, puede expresarse como una fecha (xsd:date), una fecha y un tiempo (xsd:dateTime), o un año (xsd:gYear). @es
scope note: Rækkeviden for denne egenskab er bevidst generisk defineret med det formål at tillade forskellige niveauer af tidslig præcision ifm. angivelse af slutdatoen for en periode. Den kan eksempelvis udtrykkes som en dato (xsd:date), en dato og et tidspunkt (xsd:dateTime), eller et årstal (xsd:gYear). @da
scope note: Obor hodnot této vlastnosti je úmyslně obecný, aby umožnil různé úrovně časového rozlišení pro specifikaci konce doby trvání. Ten může být kupříkladu vyjádřen datumem (xsd:date), datumem a časem (xsd:dateTime) či rokem (xsd:gYear). @cs
scope note: La range di questa proprietà è volutamente generico, con lo scopo di consentire diversi livelli di precisione temporale per specificare la fine di un periodo. Ad esempio, può essere espresso con una data (xsd:date), una data e un'ora (xsd:dateTime), o un anno (xsd:gYear). @it

Note
type: Class
comment: A short note, typically less than a single paragraph. A "tweet" is an example, or a "status update"
subclass of: Object

Has Part
type: Property
comment: A related resource that is included either physically or logically in the described resource.
subPropertyOf: Relation
date: 2008-01-14
date: 2000-07-11
description: This property is intended to be used with non-literal values. This property is an inverse property of Is Part Of.
Relation: hasPart-003
Has Version: hasPart-003
issued: 2000-07-11
Date Modified: 2008-01-14
note: This term is intended to be used with non-literal values as defined in the DCMI Abstract Model (http://dublincore.org/documents/abstract-model/). As of December 2007, the DCMI Usage Board is seeking a way to express this intention with a formal range declaration.

PTP gateware with openXC7
type: Proposal
type: Project
proposal name: PTP gateware with openXC7
proposal status: Selected
proposal website: regymm
to fund: Entrust Fund

Min-length constraint component
type: Parameterizable
type: Constraint component
comment: A constraint component that can be used to restrict the minimum string length of value nodes.
parameter: MinLengthConstraintComponent-minLength

TextQuoteSelector
type: Class
comment: The TextQuoteSelector describes a range of text by copying it, and including some of the text immediately before (a prefix) and after (a suffix) it to distinguish between multiple copies of the same sequence of characters.
subclass of: Selector

Lemmy
type: CompletedProject
type: Proposal
type: Project
proposal name: Lemmy
proposal status: Complete
proposal website: lemmy
to fund: Discovery Fund

And constraint component
type: Parameterizable
type: Constraint component
comment: A constraint component that can be used to test whether a value node conforms to all members of a provided list of shapes.
parameter: AndConstraintComponent-and

Packet classification extensions for Netfilter
type: RunningProject
type: Proposal
type: Project
proposal name: Packet classification extensions for Netfilter
proposal status: Running
proposal website: www.netfilter.org
to fund: Assure Fund

SpdxElement
type: Class
comment: An SpdxElement is any thing described in SPDX, either a document or an SpdxItem. SpdxElements can be related to other SpdxElements.
subclass of: Class
  type: Restriction
  maxQualifiedCardinality: 1
  onDataRange: string
  onProperty: comment
subclass of: Class
  type: Restriction
  minQualifiedCardinality: 0
  onClass: Annotation
  onProperty: annotation
subclass of: Class
  type: Restriction
  minQualifiedCardinality: 0
  onClass: Relationship
  onProperty: relationship
subclass of: Class
  type: Restriction
  onDataRange: string
  onProperty: name
  qualifiedCardinality: 1
term status: stable

constraint (in SPARQL)
type: Property
comment: Links a shape with SPARQL constraints.
domain: Shape
range: SPARQL constraint

target node
type: Property
comment: Links a shape to individual nodes, indicating that these nodes must conform to the shape.
domain: Shape

hasSource
type: Property
comment: The resource that the ResourceSelection, or its subclass SpecificResource, is refined from, or more specific than. Please note that the domain ( oa:ResourceSelection ) is not used directly in the Web Annotation model.
domain: ResourceSelection

RA-Sentinel
type: RunningProject
type: Proposal
type: Project
proposal name: RA-Sentinel
proposal status: Running
proposal website: RA-Sentinel
to fund: Entrust Fund

catalog
type: Property
type: ObjectProperty
comment: A catalog whose contents are of interest in the context of this catalog.
comment: Katalog, jehož obsah je v kontextu tohoto katalogu zajímavý. @cs
comment: Et katalog hvis indhold er relevant i forhold til det aktuelle katalog. @da
comment: Un catalogo i cui contenuti sono di interesse nel contesto di questo catalogo. @it
comment: Un catálogo cuyo contenido es de interés en el contexto del catálogo que está siendo descripto. @es
domain: Catalog
label: katalog @da
label: catalogo @it
label: catálogo @es
range: Catalog
subPropertyOf: Has Part
subPropertyOf: member
alternative label: har delkatalog @da
change note: Nová vlastnost přidaná ve verzi DCAT 2.0. @cs
change note: Nueva propiedad agregada en DCAT 2.0. @es
change note: New property added in DCAT 2.0.
change note: Nuova proprietà aggiunta in DCAT 2.0. @it

Remote PKCS#11
type: CompletedProject
type: Proposal
type: Project
proposal name: Remote PKCS#11
proposal status: Complete
proposal website: RemotePKCS11.asn1
to fund: InternetHardeningFund

eduVPN on Apple part II
type: CompletedProject
type: Proposal
type: Project
proposal name: eduVPN on Apple part II
proposal status: Complete
proposal website: eduvpn.org
to fund: VPN Fund

relationshipType contains
type: RelationshipType
type: Thing
type: NamedIndividual
comment: A Relationship of relationshipType_contains expresses that an SPDXElement contains the relatedSPDXElement. For example, a Package contains a File. (relationshipType_contains introduced in SPDX 2.0 deprecates property 'hasFile' from SPDX 1.2)
term status: stable

entailment
type: Property
comment: An entailment regime that indicates what kind of inferencing is required by a shapes graph.
domain: Ontology

lib25519 for ARM
type: RunningProject
type: Proposal
type: Project
proposal name: lib25519 for ARM
proposal status: Running
proposal website: lib25519.cr.yp.to
to fund: Entrust Fund

QualifiedMaxCountConstraintComponent-qualifiedValueShapesDisjoint
type: Shape
type: Property shape
type: Parameter
datatype: boolean
optional: true
path: qualified value shapes disjoint

Cloud hosting service portability
type: Proposal
type: Project
proposal name: Cloud hosting service portability
proposal status: Selected
proposal website: protagio.nl
to fund: Entrust Fund

distinctMembers
type: Property
comment: The property that determines the collection of pairwise different individuals in a owl:AllDifferent axiom.
domain: AllDifferent
range: List

SimpleLicensingInfo
type: Class
comment: The SimpleLicenseInfo class includes all resources that represent simple, atomic, licensing information.
subclass of: AnyLicenseInfo
subclass of: Class
  type: Restriction
  minQualifiedCardinality: 0
  onClass: CrossRef
  onProperty: crossRef
subclass of: Class
  type: Restriction
  onDataRange: string
  onProperty: licenseId
  qualifiedCardinality: 1
subclass of: Class
  type: Restriction
  maxQualifiedCardinality: 1
  onDataRange: string
  onProperty: comment
subclass of: Class
  type: Restriction
  minQualifiedCardinality: 0
  onDataRange: anyURI
  onProperty: seeAlso
subclass of: Class
  type: Restriction
  maxQualifiedCardinality: 1
  onDataRange: string
  onProperty: name
term status: stable

quadro di delimitazione
type: DatatypeProperty
type: Property
domain: Location
label: ohraničení oblasti @cs
label: cuadro delimitador @es
label: bounding box
change note: Nuova proprietà aggiunta in DCAT 2.0. @it
change note: New property added in DCAT 2.0.
change note: Propiedad nueva agregada en DCAT 2.0. @es
change note: Nová vlastnost přidaná ve verzi DCAT 2.0. @cs
change note: Ny egenskab tilføjet i DCAT 2.0. @da
definition: The geographic bounding box of a resource.
definition: El cuadro delimitador geográfico para un recurso. @es
definition: Ohraničení geografické oblasti zdroje. @cs
definition: Il riquadro di delimitazione geografica di una risorsa. @it
definition: Den geografiske omskrevne firkant af en ressource. @da
scope note: Rækkevidden for denne egenskab er bevidst generisk defineret med det formål at tillade forskellige kodninger af geometrier. Geometrien kan eksempelvis repræsenteres som WKT (geosparql:asWKT [GeoSPARQL]) eller [GML] (geosparql:asGML [GeoSPARQL]). @da
scope note: Obor hodnot této vlastnosti je úmyslně obecný, aby umožnil různé kódování geometrií. Geometrie by kupříkladu mohla být kódována jako WKT (geosparql:wktLiteral [GeoSPARQL]) či [GML] (geosparql:asGML [GeoSPARQL]). @cs
scope note: Il range di questa proprietà è volutamente generica, con lo scopo di consentire diverse codifiche geometriche. Ad esempio, la geometria potrebbe essere codificata con WKT (geosparql:wktLiteral [GeoSPARQL]) o [GML] (geosparql:asGML [GeoSPARQL]). @it
scope note: The range of this property is intentionally generic, with the purpose of allowing different geometry encodings. E.g., the geometry could be encoded with as WKT (geosparql:wktLiteral [GeoSPARQL]) or [GML] (geosparql:asGML [GeoSPARQL]).
scope note: El rango de esta propiedad es intencionalmente genérico con el propósito de permitir distintas codificaciones geométricas. Por ejemplo, la geometría puede ser codificada como WKT (geosparql:wktLiteral [GeoSPARQL]) o [GML] (geosparql:asGML [GeoSPARQL]). @es

Resource
type: Class
comment: The class resource, everything.

Snippet
type: Class
comment: The set of bytes in a file. The name of the snippet is the name of the file appended with the byte range in parenthesis (ie: "./file/name(2145:5532)")
subclass of: SpdxItem
subclass of: Class
  type: Restriction
  minQualifiedCardinality: 1
  onClass: StartEndPointer
  onProperty: range
subclass of: Class
  type: Restriction
  minQualifiedCardinality: 0
  onClass: AnyLicenseInfo
  onProperty: licenseInfoInSnippet
subclass of: Class
  type: Restriction
  onClass: File
  onProperty: snippetFromFile
  qualifiedCardinality: 1
term status: stable

checksumAlgorithm sha1
type: ChecksumAlgorithm
type: Thing
type: NamedIndividual
comment: Indicates the algorithm used was SHA-1
term status: stable

content
type: Property
type: DatatypeProperty
comment: The content of the object.
domain: Object
range: Class
  unionOf: langString
  unionOf: string

ObjectProperty
type: Class
comment: The class of object properties.
subclass of: Property

checksumAlgorithm sha224
type: ChecksumAlgorithm
type: Thing
type: NamedIndividual
comment: Indicates the algorithm used was SHA224
term status: stable

FileSender
type: CompletedProject
type: Proposal
type: Project
proposal name: FileSender
proposal status: Complete
proposal website: filesender.org
to fund: FileSender

Review
type: Class
comment: This class has been deprecated in favor of an Annotation with an Annotation type of review.
subclass of: Class
  type: Restriction
  maxQualifiedCardinality: 1
  onDataRange: string
  onProperty: reviewer
subclass of: Class
  type: Restriction
  maxQualifiedCardinality: 1
  onDataRange: string
  onProperty: comment
subclass of: Class
  type: Restriction
  onDataRange: dateTime
  onProperty: reviewDate
  qualifiedCardinality: 1
deprecated: true
term status: deprecated

highlighting
type: Concept
type: Motivation
comment: The motivation for when the user intends to highlight the Target resource or segment of it.

qualified max count
type: Property
comment: The maximum number of value nodes that can conform to the shape.

Libre-SOC, Coriolis2 ASIC Layout Collaboration
type: Proposal
type: Project
proposal name: Libre-SOC, Coriolis2 ASIC Layout Collaboration
proposal status: Selected
proposal website: nlnet 2019 coriolis2
to fund: PET Fund

standardLicenseHeaderHtml
type: Property
type: DatatypeProperty
comment: HTML representation of the standard license header
domain: ListedLicense
term status: stable

timestamp
type: DatatypeProperty
type: Property
comment: Timestamp
domain: CrossRef
range: dateTime

Elm Matrix SDK
type: RunningProject
type: Proposal
type: Project
proposal name: Elm Matrix SDK
proposal status: Running
proposal website: elm-matrix-sdk
to fund: Entrust Fund

Gash
type: RunningProject
type: Proposal
type: Project
proposal name: Gash
proposal status: Running
proposal website: gash
to fund: Assure Fund

Identifier
type: Property
comment: An unambiguous reference to the resource within a given context.
subPropertyOf: Identifier
date: 2008-01-14
description: Recommended best practice is to identify the resource by means of a string conforming to a formal identification system.
description: Recommended practice is to identify the resource by means of a string conforming to an identification system. Examples include International Standard Book Number (ISBN), Digital Object Identifier (DOI), and Uniform Resource Name (URN). Persistent identifiers should be provided as HTTP URIs.
Relation: identifierT-001
Has Version: identifierT-001
issued: 2008-01-14
Date Modified: 2008-01-14

Secushare Box
type: CompletedProject
type: Proposal
type: Project
proposal name: Secushare Box
proposal status: Complete
proposal website: box.secushare.org
to fund: InternetHardeningFund

Provenance Statement
type: Class
comment: Any changes in ownership and custody of a resource since its creation that are significant for its authenticity, integrity, and interpretation.
comment: A statement of any changes in ownership and custody of a resource since its creation that are significant for its authenticity, integrity, and interpretation.
date: 2008-01-14
Relation: ProvenanceStatement-001
Has Version: ProvenanceStatement-001
issued: 2008-01-14

bcc
type: Property
type: ObjectProperty
comment: Identifies one or more Objects that are part of the private secondary audience of this Object.
domain: Object
range: Class
  unionOf: Object
  unionOf: Link

owi
type: Proposal
type: Project
proposal name: owi
proposal status: Selected
proposal website: owi
to fund: Core Fund

versionIRI
type: Property
type: OntologyProperty
comment: The property that identifies the version IRI of an ontology.
domain: Ontology
range: Ontology

SCE, DelTiC and Antler
type: Proposal
type: RunningProject
type: Project
proposal name: SCE, DelTiC and Antler
proposal status: Running
proposal website: sce
proposal website: antler
to fund: Core Fund

MirageVPN
type: RunningProject
type: Proposal
type: Project
proposal name: MirageVPN
proposal status: Running
proposal website: robur.coop
to fund: Assure Fund

Accrual Periodicity
type: Property
comment: The frequency with which items are added to a collection.
domain: Collection
range: Frequency
range includes: Frequency
date: 2010-10-11
date: 2005-06-13
description: Recommended practice is to use a value from the Collection Description Frequency Vocabulary [[DCMI-COLLFREQ](https://dublincore.org/groups/collections/frequency/)].
Relation: accrualPeriodicity-003
Has Version: accrualPeriodicity-003
issued: 2005-06-13
Date Modified: 2010-10-11

Subject
type: Property
comment: The topic of the resource.
date: 1999-07-02
description: Typically, the subject will be represented using keywords, key phrases, or classification codes. Recommended best practice is to use a controlled vocabulary.
issued: 1999-07-02
note: A [second property](/specifications/dublin-core/dcmi-terms/#http://purl.org/dc/terms/subject) with the same name as this property has been declared in the [dcterms: namespace](http://purl.org/dc/terms/). See the Introduction to the document [DCMI Metadata Terms](/specifications/dublin-core/dcmi-terms/) for an explanation.

propertyChainAxiom
type: Property
comment: The property that determines the n-tuple of properties that build a sub property chain of a given property.
domain: ObjectProperty
range: List

annotation property
type: Property
comment: The annotation property that shall be set.
domain: Result annotation
range: Property

min inclusive
type: Property
comment: Specifies the minimum inclusive value of each value node.

origin
type: Property
type: ObjectProperty
comment: For certain activities, specifies the entity from which the action is directed.
domain: Activity
range: Class
  unionOf: Object
  unionOf: Link

Zero-allocation web servers in roc
type: RunningProject
type: Proposal
type: Project
proposal name: Zero-allocation web servers in roc
proposal status: Running
proposal website: roc
to fund: Core Fund

Richard Cyganiak
type: Agent

checksumAlgorithm sha384
type: ChecksumAlgorithm
type: Thing
type: NamedIndividual
comment: Indicates the algorithm used was SHA384
term status: stable

Access Rights
type: Property
comment: Information about who can access the resource or an indication of its security status.
comment: Information about who access the resource or an indication of its security status.
range: Rights Statement
subPropertyOf: Rights
range includes: Rights Statement
date: 2008-01-14
date: 2003-02-15
description: Access Rights may include information regarding access or restrictions based on privacy, security, or other policies.
Relation: accessRights-002
Has Version: accessRights-002
issued: 2003-02-15
Date Modified: 2008-01-14

InConstraintComponent-in
type: Shape
type: Property shape
type: Parameter
max count: 1
path: in

OpenCryptoHW
type: RunningProject
type: Proposal
type: Project
proposal name: OpenCryptoHW
proposal status: Running
proposal website: iobundle.com
to fund: Assure Fund

Add
type: Class
comment: To Add an Object or Link to Something
subclass of: Activity

packageFileName
type: DatatypeProperty
type: Property
comment: The base name of the package file name. For example, zlib-1.2.5.tar.gz.
domain: Package
term status: stable

theme taxonomy
type: Property
type: ObjectProperty
comment: Το σύστημα οργάνωσης γνώσης που χρησιμοποιείται για την κατηγοριοποίηση των συνόλων δεδομένων του καταλόγου. @el
comment: لائحة التصنيفات المستخدمه لتصنيف قوائم البيانات ضمن الفهرس @ar
comment: カタログのデータセットを分類するために用いられる知識組織化体系（KOS；knowledge organization system）。 @ja
comment: Systém organizace znalostí (KOS) použitý pro klasifikaci datových sad v katalogu. @cs
comment: Vidensorganiseringssystem (KOS) som anvendes til at klassificere datasæt i kataloget. @da
comment: El sistema de organización del conocimiento utilizado para clasificar conjuntos de datos de catálogos. @es
comment: Le systhème d'ogranisation de connaissances utilisé pour classifier les jeux de données du catalogue. @fr
comment: The knowledge organization system (KOS) used to classify catalog's datasets.
comment: Il sistema di organizzazione della conoscenza (KOS) usato per classificare i dataset del catalogo. @it
domain: Catalog
label: taxonomía de temas @es
label: taxonomie témat @cs
label: emnetaksonomi @da
label: Ταξινομία θεματικών κατηγοριών. @el
label: قائمة التصنيفات @ar
label: テーマ @ja
label: tassonomia dei temi @it
label: taxonomie de thèmes @fr
range includes: Collection
range includes: Ontology
range includes: ConceptScheme
alternative label: temataksonomi @da
scope note: Si raccomanda che la tassonomia sia organizzata in uno skos:ConceptScheme, skos:Collection, owl:Ontology o simili, che permette ad ogni membro di essere indicato da un IRI e pubblicato come linked-data. @it
scope note: Se recomienda que la taxonomía se organice como un skos:ConceptScheme, skos:Collection, owl:Ontology o similar, los cuáles permiten que cada miembro se denote con una IRI y se publique como datos enlazados. @es
scope note: Je doporučeno, aby byla taxonomie vyjádřena jako skos:ConceptScheme, skos:Collection, owl:Ontology nebo podobné, aby mohla být každá položka identifikována pomocí IRI a publikována jako propojená data. @cs
scope note: It is recommended that the taxonomy is organized in a skos:ConceptScheme, skos:Collection, owl:Ontology or similar, which allows each member to be denoted by an IRI and published as linked-data.
scope note: Det anbefales at taksonomien organiseres i et skos:ConceptScheme, skos:Collection, owl:Ontology eller lignende, som giver mulighed for at ethvert medlem af taksonomien kan forsynes med en IRI og udgives som linked-data. @da

p3pch4t
type: RunningProject
type: Proposal
type: Project
proposal name: p3pch4t
proposal status: Running
proposal website: p3pch4t
to fund: Core Fund

latitude
type: FunctionalProperty
type: Property
type: DatatypeProperty
comment: The latitude
domain: Place
range: float

Solid-Search
type: CompletedProject
type: Proposal
type: Project
proposal name: Solid-Search
proposal status: Complete
proposal website: ontola.io
to fund: Discovery Fund

TLS-KDH mbed
type: CompletedProject
type: Proposal
type: Project
proposal name: TLS-KDH mbed
proposal status: Complete
proposal website: tls-kdh.arpa2.net
to fund: PET Fund

ChecksumAlgorithm
type: Class
comment: Algorighm for Checksums.
term status: stable

Fediverse Test Suite
type: RunningProject
type: Project
type: Proposal
proposal name: Fediverse Test Suite
proposal status: Running
proposal website: develop
proposal website: fedidevs.org
to fund: Core Fund

Relationship
type: Class
comment: Represents a Social Graph relationship between two Individuals (indicated by the 'a' and 'b' properties)
subclass of: Object

suffix
type: Property
comment: The snippet of text that occurs immediately after the text which is being selected.

CNSPRCY
type: RunningProject
type: Proposal
type: Project
proposal name: CNSPRCY
proposal status: Running
proposal website: cnsprcy
to fund: Assure Fund

DNSvizor
type: Proposal
type: Project
proposal name: DNSvizor
proposal status: Selected
proposal website: dnsvizor
to fund: Entrust Fund

Kaidan
type: CompletedProject
type: Proposal
type: Project
proposal name: Kaidan
proposal status: Complete
proposal website: kaidan.im
to fund: PET Fund

OCCRP Aleph disambiguation
type: CompletedProject
type: Proposal
type: Project
proposal name: OCCRP Aleph disambiguation
proposal status: Complete
proposal website: aleph.occrp.org
to fund: Discovery Fund

relationshipType fileModified
type: RelationshipType
type: Thing
type: NamedIndividual
comment: A Relationship of relationshipType_fileModified expresses that the SPDXElement is a file which is a modified version of the relatedSPDXElement file. For example, a file (the SPDXElement) has been patched to modify the contents of the original file (the SPDXElement). This relationship is typically used to express the result of a patched package when the actual patchfile is not present.
term status: stable

Icosa Gallery
type: Proposal
type: Project
proposal name: Icosa Gallery
proposal status: Selected
proposal website: icosa-gallery
to fund: Entrust Fund

Rights
type: Property
comment: Information about rights held in and over the resource.
range: Rights Statement
subPropertyOf: Rights
range includes: Rights Statement
date: 2008-01-14
description: Typically, rights information includes a statement about various property rights associated with the resource, including intellectual property rights. Recommended practice is to refer to a rights statement with a URI. If this is not possible or feasible, a literal value (name, label, or short text) may be provided.
description: Typically, rights information includes a statement about various property rights associated with the resource, including intellectual property rights.
Relation: rightsT-001
Has Version: rightsT-001
issued: 2008-01-14
Date Modified: 2008-01-14

URI
type: Datatype
type: Class
comment: The set of identifiers constructed according to the generic syntax for Uniform Resource Identifiers as specified by the Internet Engineering Task Force.
date: 2000-07-11
date: 2008-01-14
Relation: URI-003
Has Version: URI-003
issued: 2000-07-11
Date Modified: 2008-01-14

IPDL II
type: RunningProject
type: Proposal
type: Project
proposal name: IPDL II
proposal status: Running
proposal website: IPDL-Maude
to fund: Assure Fund

eduVPN Linux client 2.0
type: CompletedProject
type: Proposal
type: Project
proposal name: eduVPN Linux client 2.0
proposal status: Complete
proposal website: www.eduvpn.org
to fund: VPN Fund

Movim
type: CompletedProject
type: Proposal
type: Project
proposal name: Movim
proposal status: Complete
proposal website: movim.eu
to fund: PET Fund

Bonfire Search & Discovery
type: CompletedProject
type: Proposal
type: Project
proposal name: Bonfire Search & Discovery
proposal status: Complete
proposal website: bonfire.cafe
to fund: Discovery Fund

WikiRate: More Sites, More Cites
type: CompletedProject
type: Proposal
type: Project
proposal name: WikiRate: More Sites, More Cites
proposal status: Complete
proposal website: wikirate.org
to fund: Assure Fund

source shape
type: Property
comment: The shape that is was validated when the result was produced.
domain: Abstract result
range: Shape

Spectrum Applications
type: Proposal
type: Project
proposal name: Spectrum Applications
proposal status: Selected
proposal website: spectrum-os.org
to fund: Entrust Fund

moderating
type: Concept
type: Motivation
comment: The motivation for when the user intends to assign some value or quality to the Target.

Mediator
type: Property
comment: An entity that mediates access to the resource and for whom the resource is intended or useful.
comment: An entity that mediates access to the resource.
range: Agent Class
subPropertyOf: Audience
range includes: Agent Class
date: 2001-05-21
date: 2008-01-14
description: In an educational context, a mediator might be a parent, teacher, teaching assistant, or care-giver.
Relation: mediator-003
Has Version: mediator-003
issued: 2001-05-21
Date Modified: 2008-01-14

Rosenpass
type: Proposal
type: Project
proposal name: Rosenpass
proposal status: Selected
proposal website: pqxwg
to fund: Assure Fund

Is Required By
type: Property
comment: A related resource that requires the described resource to support its function, delivery, or coherence.
subPropertyOf: Relation
date: 2000-07-11
date: 2008-01-14
description: This property is intended to be used with non-literal values. This property is an inverse property of Requires.
Relation: isRequiredBy-003
Has Version: isRequiredBy-003
issued: 2000-07-11
Date Modified: 2008-01-14
note: This term is intended to be used with non-literal values as defined in the DCMI Abstract Model (http://dublincore.org/documents/abstract-model/). As of December 2007, the DCMI Usage Board is seeking a way to express this intention with a formal range declaration.

A proof of concept of identity-based encryption
type: CompletedProject
type: Proposal
type: Project
proposal name: A proof of concept of identity-based encryption
proposal status: Complete
proposal website: en
to fund: PET Fund

mCaptcha
type: RunningProject
type: Proposal
type: Project
proposal name: mCaptcha
proposal status: Running
proposal website: mcaptcha.org
to fund: Entrust Fund

PET Fund
fund label: NGI0 PET
proposals accepted: 146
proposals submitted: 720

Open Hardware Manuals
type: RunningProject
type: Proposal
type: Project
proposal name: Open Hardware Manuals
proposal status: Running
proposal website: nimble
to fund: Core Fund

GnuTLS
type: CompletedProject
type: Proposal
type: Project
proposal name: GnuTLS
proposal status: Complete
proposal website: gnutls-kdh
to fund: InternetHardeningFund

ZIP file format description
type: CompletedProject
type: Proposal
type: Project
proposal name: ZIP file format description
proposal status: Complete
proposal website: binaryanalysis-ng
to fund: BinaryAnalysisFund

Irdest
type: CompletedProject
type: Proposal
type: Project
proposal name: Irdest
proposal status: Complete
proposal website: irde.st
to fund: Discovery Fund

expression
type: Property
comment: The node expression that must return true for the value nodes.

MinInclusiveConstraintComponent-minInclusive
type: Shape
type: Property shape
type: Parameter
max count: 1
node kind: Literal
path: min inclusive

LibrePCB
type: RunningProject
type: Proposal
type: Project
proposal name: LibrePCB
proposal status: Running
proposal website: librepcb.org
to fund: Entrust Fund

Balthazar
type: CompletedProject
type: Proposal
type: Project
proposal name: Balthazar
proposal status: Complete
proposal website: balthazar.space
to fund: PET Fund

namespace
type: Property
comment: The namespace associated with a prefix in a prefix declaration.
domain: Prefix declaration

OpenCryptoTester
type: RunningProject
type: Proposal
type: Project
proposal name: OpenCryptoTester
proposal status: Running
proposal website: IObundle
to fund: Assure Fund

hreflang
type: FunctionalProperty
type: Property
type: DatatypeProperty
comment: A hint about the language of the referenced resource
domain: Link
range: language

offen
type: CompletedProject
type: Proposal
type: Project
proposal name: offen
proposal status: Complete
proposal website: www.offen.dev
to fund: PET Fund

isDefinedBy
type: Property
comment: The defininition of the subject resource.
domain: Resource
subPropertyOf: seeAlso

Nixcloud
type: CompletedProject
type: Proposal
type: Project
proposal name: Nixcloud
proposal status: Complete
proposal website: nixcloud.io
to fund: InternetHardeningFund

Peertube plugin livechat
type: RunningProject
type: Proposal
type: Project
proposal name: Peertube plugin livechat
proposal status: Running
proposal website: peertube-plugin-livechat
to fund: Entrust Fund

relationshipType distributionArtifact
type: RelationshipType
type: Thing
type: NamedIndividual
comment: A Relationship of relationshipType_distributionArtifact expresses that distributing the SPDXElement requires that the relatedSPDXElement also be distributed. For example, distributing a binary File may require that a source tarball (another File) be made available with the distribuiton.
term status: stable

checksumAlgorithm sha3 256
type: ChecksumAlgorithm
type: Thing
type: NamedIndividual
comment: Indicates the algorithm used was SHA3-256.
term status: stable

Target
type: Class
comment: The base class of targets such as those based on SPARQL queries.
subclass of: Resource

eduVPN on Apple
type: CompletedProject
type: Proposal
type: Project
proposal name: eduVPN on Apple
proposal status: Complete
proposal website: eduvpn.org
to fund: VPN Fund

result annotation
type: Property
comment: Links a SPARQL validator with zero or more sh:ResultAnnotation instances, defining how to derive additional result properties based on the variables of the SELECT query.
domain: SPARQL SELECT validator
range: Result annotation

Inko
type: RunningProject
type: Proposal
type: Project
proposal name: Inko
proposal status: Running
proposal website: inko-lang.org
to fund: Entrust Fund

GetDNS
type: CompletedProject
type: Proposal
type: Project
proposal name: GetDNS
proposal status: Complete
proposal website: getdnsapi.net
to fund: InternetHardeningFund

Validator
type: Class
comment: The class of validators, which provide instructions on how to process a constraint definition. This class serves as base class for the SPARQL-based validators and other possible implementations.
subclass of: Resource

SPARQL SELECT executable
type: Class
comment: The class of SPARQL executables based on a SELECT query.
subclass of: SPARQL executable

Caster
type: Proposal
type: Project
proposal name: Caster
proposal status: Selected
proposal website: www.modos.tech
to fund: Entrust Fund

Statime
type: CompletedProject
type: Proposal
type: Project
proposal name: Statime
proposal status: Complete
proposal website: tweedegolf.nl
to fund: Assure Fund

longitude
type: FunctionalProperty
type: Property
type: DatatypeProperty
comment: The longitude
domain: Place
range: float

none
type: Thing
type: NamedIndividual
comment: Individual to indicate that no value is applicable for the Object.

cardinality
type: Property
comment: The property that determines the cardinality of an exact cardinality restriction.
domain: Restriction

Graphics acceleration on Replicant
type: CompletedProject
type: Proposal
type: Project
proposal name: Graphics acceleration on Replicant
proposal status: Complete
proposal website: Graphics-acceleration
to fund: PET Fund

relationshipType testcaseOf
type: RelationshipType
type: Thing
type: NamedIndividual
comment: Is to be used when SPDXRef-A is a test case used in testing SPDXRef-B.
term status: stable

source
type: Property
type: ObjectProperty
comment: Conveys some sort of source from which the content markup was derived, as a form of provenance, or to support future editing by clients. The source property is intended to convey some sort of source from which the content markup was derived, as a form of provenance, or to support future editing by clients. In general, clients do the conversion from source to content, not the other way around. The value of source is itself an object which uses its own content and mediaType fields to supply source information.
domain: Object
range: Object

externalReferenceSite
type: DatatypeProperty
type: Property
comment: Website for the maintainers of the external reference site
domain: ReferenceType
term status: stable

Kazarma Release
type: RunningProject
type: Proposal
type: Project
proposal name: Kazarma Release
proposal status: Running
proposal website: kazarma
to fund: Entrust Fund

Karrot
type: Proposal
type: Project
proposal name: Karrot
proposal status: Selected
proposal website: karrot.world
to fund: Entrust Fund

Practical Tools to Build the Context Web
type: CompletedProject
type: Proposal
type: Project
proposal name: Practical Tools to Build the Context Web
proposal status: Complete
proposal website: perspectives-documentation
to fund: Discovery Fund

temporal resolution
type: DatatypeProperty
type: Property
comment: periodo di tempo minimo risolvibile in un set di dati. @it
comment: mindste tidsperiode der kan resolveres i datasættet. @da
comment: período de tiempo mínimo en el conjunto de datos. @es
comment: minimální doba trvání rozlišitelná v datové sadě. @cs
comment: minimum time period resolvable in a dataset.
label: risoluzione temporale @it
label: časové rozlišení @cs
label: tidslig opløsning @da
label: resolución temporal @es
range: duration
change note: Nová vlastnost přidaná ve verzi DCAT 2.0. @cs
change note: Nuova proprietà aggiunta in DCAT 2.0. @it
change note: New property added in DCAT 2.0.
change note: Nueva propiedad añadida en DCAT 2.0. @es
editorial note: Kan optræde i forbindelse med beskrivelse af datasættet eller datasætditributionen, så der er ikke angivet et domæne for egenskaben. @da
editorial note: Might appear in the description of a Dataset or a Distribution, so no domain is specified.
editorial note: Může se vyskytnout v popisu Datové sady nebo Distribuce, takže nebyl specifikován definiční obor. @cs
scope note: Risoluzioni temporali alternative potrebbero essere fornite come diverse distribuzioni di set di dati. @it
scope note: Hvis datasættet er en tidsserie, så bør denne egenskab svare til afstanden mellem elementerne i tidsserien. For andre typer af datasæt indikerer denne egenskab den mindste tidsforskel mellem elementer i datasættet. @da
scope note: Se il set di dati è una serie temporale, questo dovrebbe corrispondere alla spaziatura degli elementi della serie. Per altri tipi di set di dati, questa proprietà di solito indica la più piccola differenza di tempo tra gli elementi nel set di dati. @it
scope note: If the dataset is a time-series this should correspond to the spacing of items in the series. For other kinds of dataset, this property will usually indicate the smallest time difference between items in the dataset.
scope note: Distintas distribuciones del conjunto de datos pueden tener resoluciones temporales diferentes. @es
scope note: Pokud je datová sada časovou řadou, měla by tato vlastnost odpovídat rozestupu položek v řadě. Pro ostatní druhy datových sad bude tato vlastnost obvykle indikovat nejmenší časovou vzdálenost mezi položkami této datové sady. @cs
scope note: Si el conjunto de datos es una serie temporal, debe corresponder al espaciado de los elementos de la serie. Para otro tipo de conjuntos de datos, esta propiedad indicará usualmente la menor diferencia de tiempo entre elementos en el dataset. @es
scope note: Alternative tidslige opløsninger kan leveres som forskellige datasætdistributioner. @da
scope note: Různá časová rozlišení mohou být poskytována jako různé distribuce datové sady. @cs
scope note: Alternative temporal resolutions might be provided as different dataset distributions.

checksumAlgorithm md6
type: ChecksumAlgorithm
type: Thing
type: NamedIndividual
comment: Indicates the algorithm used was MD6
term status: stable

Bertie
type: RunningProject
type: Proposal
type: Project
proposal name: Bertie
proposal status: Running
proposal website: cryspen.com
to fund: Assure Fund

relationshipType fileDeleted
type: RelationshipType
type: Thing
type: NamedIndividual
comment: A Relationship of relationshipType_fileDeleted expresses that the SPDXElement is a package where the relatedSPDXElement file has been removed. For example, a package has been patched to remove a file a file (the relatedSPDXElement resulting in the patched package (the SPDXElement). This relationship is typically used to express the result of a patched package when the actual patchfile is not present.
term status: stable

referenceCategory
type: ObjectProperty
type: Property
comment: Category for the external reference
domain: ExternalRef
range: ReferenceCategory
term status: stable

relationshipType generates
type: RelationshipType
type: Thing
type: NamedIndividual
comment: A Relationship of relationshipType_generates expresses that an SPDXElement generates the relatedSPDXElement. For example, a source File generates a binary File.
term status: stable

disjointWith
type: Property
comment: The property that determines that two given classes are disjoint.
domain: Class
range: Class

Mailpile Search Integration
type: CompletedProject
type: Proposal
type: Project
proposal name: Mailpile Search Integration
proposal status: Complete
proposal website: www.mailpile.is
to fund: Discovery Fund

relationshipType testOf
type: RelationshipType
type: Thing
type: NamedIndividual
comment: Is to be used when SPDXRef-A is used for testing SPDXRef-B.
term status: stable

Physical Medium
type: Class
comment: A physical material or carrier.
subclass of: Media Type
date: 2008-01-14
description: Examples include paper, canvas, or DVD.
Relation: PhysicalMedium-001
Has Version: PhysicalMedium-001
issued: 2008-01-14

licenseExceptionText
type: DatatypeProperty
type: Property
comment: Full text of the license exception.
domain: LicenseException
term status: stable

Record Federation for Corteza Clouds
type: CompletedProject
type: Proposal
type: Project
proposal name: Record Federation for Corteza Clouds
proposal status: Complete
proposal website: www.cortezaproject.org
to fund: Discovery Fund

checksumAlgorithm blake2b384
type: ChecksumAlgorithm
type: Thing
type: NamedIndividual
comment: Indicates the algorithm used was BLAKE2b-384.
term status: stable

Pretty Easy Privacy
type: CompletedProject
type: Proposal
type: Project
proposal name: Pretty Easy Privacy
proposal status: Complete
proposal website: pep.foundation
to fund: InternetHardeningFund

JavaScript library
type: Property
comment: Declares which JavaScript libraries are needed to execute this.
range: JavaScript library

Balthazar - One laptop for the new internet age.
type: CompletedProject
type: Proposal
type: Project
proposal name: Balthazar - One laptop for the new internet age.
proposal status: Complete
proposal website: balthazar.space
to fund: PET Fund

Source
type: Property
comment: A related resource from which the described resource is derived.
subPropertyOf: Relation
subPropertyOf: Source
date: 2008-01-14
description: This property is intended to be used with non-literal values. The described resource may be derived from the related resource in whole or in part. Best practice is to identify the related resource by means of a URI or a string conforming to a formal identification system.
description: The described resource may be derived from the related resource in whole or in part. Recommended best practice is to identify the related resource by means of a string conforming to a formal identification system.
Relation: sourceT-001
Has Version: sourceT-001
issued: 2008-01-14
Date Modified: 2008-01-14
note: This term is intended to be used with non-literal values as defined in the DCMI Abstract Model (http://dublincore.org/documents/abstract-model/). As of December 2007, the DCMI Usage Board is seeking a way to express this intention with a formal range declaration.

GUN P2P Encryption
type: CompletedProject
type: Proposal
type: Project
proposal name: GUN P2P Encryption
proposal status: Complete
proposal website: gun.eco
to fund: InternetHardeningFund

renderedVia
type: Property
comment: A system that was used by the application that created the Annotation to render the resource.
domain: SpecificResource

GNU Name System
type: Project
type: Proposal
type: CompletedProject
proposal name: GNU Name System
proposal status: Complete
proposal website: dasein
proposal website: gns
to fund: Discovery Fund

Mosaic
type: CompletedProject
type: Proposal
type: Project
proposal name: Mosaic
proposal status: Complete
proposal website: Mosaic
to fund: PET Fund

attachment
type: Property
type: ObjectProperty
comment: Identifies a resource attached or related to an object that potentially requires special handling. The intent is to provide a model that is at least semantically similar to attachments in email.
domain: Object
range: Class
  unionOf: Link
  unionOf: Object
equivalentProperty: attachments

R5N-DHT
type: Proposal
type: Project
proposal name: R5N-DHT
proposal status: Selected
proposal website: gnunet.org
to fund: Assure Fund

relationshipType ancestorOf
type: RelationshipType
type: Thing
type: NamedIndividual
comment: A Relationship of relationshipType_ancestorOf expresses that an SPDXElement is an ancestor of (same lineage but pre-dates) the relatedSPDXElement. For example, an upstream File is an ancestor of a modified downstream File
term status: stable

PeerTube
type: CompletedProject
type: Proposal
type: Project
proposal name: PeerTube
proposal status: Complete
proposal website: joinpeertube.org
to fund: Discovery Fund

AsymmetricProperty
type: Class
comment: The class of asymmetric properties.
subclass of: ObjectProperty

Meta-Press.es
type: CompletedProject
type: Proposal
type: Project
proposal name: Meta-Press.es
proposal status: Complete
proposal website: www.meta-press.es
to fund: Discovery Fund

Equals constraint component
type: Parameterizable
type: Constraint component
comment: A constraint component that can be used to verify that the set of value nodes is equal to the set of nodes that have the focus node as subject and the value of a given property as predicate.
parameter: EqualsConstraintComponent-equals

Federated software forges with Forgejo
type: Proposal
type: Project
proposal name: Federated software forges with Forgejo
proposal status: Selected
proposal website: Gitea
to fund: Entrust Fund

Has Version
type: Property
comment: A related resource that is a version, edition, or adaptation of the described resource.
subPropertyOf: Relation
date: 2008-01-14
date: 2000-07-11
description: Changes in version imply substantive changes in content rather than differences in format. This property is intended to be used with non-literal values. This property is an inverse property of Is Version Of.
Relation: hasVersion-003
Has Version: hasVersion-003
issued: 2000-07-11
Date Modified: 2008-01-14
note: This term is intended to be used with non-literal values as defined in the DCMI Abstract Model (http://dublincore.org/documents/abstract-model/). As of December 2007, the DCMI Usage Board is seeking a way to express this intention with a formal range declaration.

current
type: FunctionalProperty
type: Property
type: ObjectProperty
comment: In a paged Collection, indicates the page that contains the most recently updated member items.
domain: Collection
range: Class
  unionOf: CollectionPage
  unionOf: Link

Contributor
type: Property
comment: An entity responsible for making contributions to the resource.
date: 1999-07-02
description: The guidelines for using names of persons or organizations as creators also apply to contributors. Typically, the name of a Contributor should be used to indicate the entity.
issued: 1999-07-02
note: A [second property](/specifications/dublin-core/dcmi-terms/#http://purl.org/dc/terms/contributor) with the same name as this property has been declared in the [dcterms: namespace](http://purl.org/dc/terms/). See the Introduction to the document [DCMI Metadata Terms](/specifications/dublin-core/dcmi-terms/) for an explanation.

Disjoint constraint component
type: Parameterizable
type: Constraint component
comment: A constraint component that can be used to verify that the set of value nodes is disjoint with the the set of nodes that have the focus node as subject and the value of a given property as predicate.
parameter: DisjointConstraintComponent-disjoint

DeprecatedClass
type: Class
comment: The class of deprecated classes.
subclass of: Class

relationshipType dataFile
type: RelationshipType
type: Thing
type: NamedIndividual
comment: Is to be used when SPDXRef-A is a data file used in SPDXRef-B. Replaced by relationshipType_dataFileOf
deprecated: true
term status: deprecated

Title
type: Property
comment: A name given to the resource.
date: 1999-07-02
issued: 1999-07-02
note: A [second property](/specifications/dublin-core/dcmi-terms/#http://purl.org/dc/terms/title) with the same name as this property has been declared in the [dcterms: namespace](http://purl.org/dc/terms/). See the Introduction to the document [DCMI Metadata Terms](/specifications/dublin-core/dcmi-terms/) for an explanation.

FileSender secure passwords
type: Proposal
type: Project
proposal name: FileSender secure passwords
proposal status: Selected
proposal website: filesender.org
to fund: FileSender

centroid
type: Property
type: DatatypeProperty
domain: Location
label: geometrisk tyngdepunkt @da
label: centroide @es
change note: New property added in DCAT 2.0.
change note: Nueva propiedad agregada en DCAT 2.0. @es
change note: Nuova proprietà aggiunta in DCAT 2.0. @it
change note: Nová vlastnost přidaná ve verzi DCAT 2.0. @cs
change note: Ny egenskab tilføjet i DCAT 2.0. @da
definition: The geographic center (centroid) of a resource.
definition: El centro geográfico (centroide) de un recurso. @es
definition: Det geometrisk tyngdepunkt (centroid) for en ressource. @da
definition: Geografický střed (centroid) zdroje. @cs
definition: Il centro geografico (centroide) di una risorsa. @it
scope note: Il range di questa proprietà è volutamente generica, con lo scopo di consentire diverse codifiche geometriche. Ad esempio, la geometria potrebbe essere codificata con WKT (geosparql:wktLiteral [GeoSPARQL]) o [GML] (geosparql:asGML [GeoSPARQL]). @it
scope note: El rango de esta propiedad es intencionalmente genérico con el objetivo de permitir distintas codificaciones geométricas. Por ejemplo, la geometría puede codificarse como WKT (geosparql:wktLiteral [GeoSPARQL]) o [GML] (geosparql:asGML [GeoSPARQL]). @es
scope note: Obor hodnot této vlastnosti je úmyslně obecný, aby umožnil různé kódování geometrií. Geometrie by kupříkladu mohla být kódována jako WKT (geosparql:wktLiteral [GeoSPARQL]) či [GML] (geosparql:asGML [GeoSPARQL]). @cs
scope note: The range of this property is intentionally generic, with the purpose of allowing different geometry encodings. E.g., the geometry could be encoded with as WKT (geosparql:wktLiteral [GeoSPARQL]) or [GML] (geosparql:asGML [GeoSPARQL]).
scope note: Rækkevidden for denne egenskab er bevidst generisk definere med det formål at tillade forskellige geokodninger. Geometrien kan eksempelvis repræsenteres som WKT (geosparql:asWKT [GeoSPARQL]) eller [GML] (geosparql:asGML [GeoSPARQL]). @da

PeerTube - Remote Transcoding
type: CompletedProject
type: Proposal
type: Project
proposal name: PeerTube - Remote Transcoding
proposal status: Complete
proposal website: joinpeertube.org
to fund: Entrust Fund

Dolphin authorisation
type: RunningProject
type: Proposal
type: Project
proposal name: Dolphin authorisation
proposal status: Running
proposal website: dolphin
to fund: Entrust Fund

DRTM implementation for AMD processors
type: Proposal
type: Project
proposal name: DRTM implementation for AMD processors
proposal status: Selected
proposal website: documentation
to fund: PET Fund

detail
type: Property
comment: Links a result with other results that provide more details, for example to describe violations against nested shapes.
domain: Abstract result
range: Abstract result

Document
type: Class
comment: Represents a digital document/file of any sort
subclass of: Object

keyword
type: DatatypeProperty
type: Property
comment: كلمة مفتاحيه توصف قائمة البيانات @ar
comment: データセットを記述しているキーワードまたはタグ。 @ja
comment: A keyword or tag describing a resource.
comment: Klíčové slovo nebo značka popisující zdroj. @cs
comment: Una palabra clave o etiqueta que describe un recurso. @es
comment: Un mot-clé ou étiquette décrivant une ressource. @fr
comment: Μία λέξη-κλειδί ή μία ετικέτα που περιγράφει το σύνολο δεδομένων. @el
comment: Et nøgleord eller tag til beskrivelse af en ressource. @da
comment: Una parola chiave o un'etichetta per descrivere la risorsa. @it
label: klíčové slovo @cs
label: parola chiave @it
label: palabra clave @es
label: nøgleord @da
label: キーワード/タグ @ja
label: λέξη-κλειδί @el
label: mot-clés @fr
label: كلمة مفتاحية @ar
subPropertyOf: Subject

start
type: Property
comment: The start position in a 0-based index at which a range of content is selected from the data in the source resource.

MaDada
type: CompletedProject
type: Proposal
type: Project
proposal name: MaDada
proposal status: Complete
proposal website: madada.fr
to fund: Discovery Fund

hasSelf
type: Property
comment: The property that determines the property that a self restriction refers to.
domain: Restriction

compression format
type: ObjectProperty
type: Property
comment: El formato de la distribución en el que los datos están en forma comprimida, e.g. para reducir el tamaño del archivo a bajar. @es
comment: Kompressionsformatet for distributionen som indeholder data i et komprimeret format, fx for at reducere størrelsen af downloadfilen. @da
comment: The compression format of the distribution in which the data is contained in a compressed form, e.g. to reduce the size of the downloadable file.
comment: Formát komprese souboru, ve kterém jsou data poskytována v komprimované podobě, např. ke snížení velikosti souboru ke stažení. @cs
comment: Il formato di compressione della distribuzione nel quale i dati sono in forma compressa, ad es. per ridurre le dimensioni del file da scaricare. @it
domain: Distribution
label: formát komprese @cs
label: formato di compressione @it
label: formato de compresión @es
label: kompressionsformat @da
range: Media Type
subPropertyOf: Format
change note: New property added in DCAT 2.0.
change note: Nová vlastnost přidaná ve verzi DCAT 2.0. @cs
change note: Nuova proprietà aggiunta in DCAT 2.0. @it
change note: Nueva propiedad agregada en DCAT 2.0. @es
change note: Ny egenskab tilføjet i DCAT 2.0. @da
scope note: Esta propiedad se debe usar cuando los archivos de la distribución están comprimidos, por ejemplo en un archivo ZIP. El formato DEBERÍA expresarse usando un 'media type', tales como los definidos en el registro IANA de 'media types' https://www.iana.org/assignments/media-types/, si está disponibles. @es
scope note: Tato vlastnost se použije, když jsou soubory v distribuci komprimovány, např. v ZIP souboru. Formát BY MĚL být vyjádřen pomocí typu média definovaného v registru IANA https://www.iana.org/assignments/media-types/, pokud existuje. @cs
scope note: This property is to be used when the files in the distribution are compressed, e.g. in a ZIP file. The format SHOULD be expressed using a media type as defined by IANA media types registry https://www.iana.org/assignments/media-types/, if available.
scope note: Denne egenskab kan anvendes når filerne i en distribution er blevet komprimeret, fx i en ZIP-fil. Formatet BØR udtrykkes ved en medietype som defineret i 'IANA media types registry', hvis der optræder en relevant medietype dér: https://www.iana.org/assignments/media-types/. @da
scope note: Questa proprietà deve essere utilizzata quando i file nella distribuzione sono compressi, ad es. in un file ZIP. Il formato DOVREBBE essere espresso usando un tipo di media come definito dal registro dei tipi di media IANA https://www.iana.org/assignments/media-types/, se disponibile. @it

summary
type: Property
type: DatatypeProperty
comment: A short summary of the object
domain: Object
range: Class
  unionOf: langString
  unionOf: string

Hyper Hyper Space
type: RunningProject
type: Proposal
type: Project
proposal name: Hyper Hyper Space
proposal status: Running
proposal website: www.hyperhyperspace.org
to fund: Assure Fund

Cryptech
type: Proposal
type: Project
proposal name: Cryptech
proposal status: Selected
proposal website: cryptech.is
to fund: Cryptech

SelfPrivacy
type: RunningProject
type: Proposal
type: Project
proposal name: SelfPrivacy
proposal status: Running
proposal website: selfprivacy.org
to fund: Entrust Fund

hasKey
type: Property
comment: The property that determines the collection of properties that jointly build a key.
domain: Class
range: List

JavaScript library URL
type: Property
comment: Declares the URLs of a JavaScript library. This should be the absolute URL of a JavaScript file. Implementations may redirect those to local files.
domain: JavaScript library

Email for expert news
type: Proposal
type: CompletedProject
type: Project
proposal name: Email for expert news
proposal status: Complete
proposal website: nep.repec.org
proposal website: biomed.news
to fund: Discovery Fund

WikiRate Insights 2
type: CompletedProject
type: Proposal
type: Project
proposal name: WikiRate Insights 2
proposal status: Complete
proposal website: wikirate.org
to fund: Discovery Fund

Free Software Vulnerability Database
type: CompletedProject
type: Proposal
type: Project
proposal name: Free Software Vulnerability Database
proposal status: Complete
proposal website: vulnerablecode
to fund: Discovery Fund

Date Submitted
type: Property
comment: Date of submission of the resource.
subPropertyOf: Date
date: 2002-07-13
date: 2008-01-14
description: Recommended practice is to describe the date, date/time, or period of time as recommended for the property Date, of which this is a subproperty. Examples of resources to which a 'Date Submitted' may be relevant include a thesis (submitted to a university department) or an article (submitted to a journal).
description: Examples of resources to which a Date Submitted may be relevant are a thesis (submitted to a university department) or an article (submitted to a journal).
Relation: dateSubmitted-002
Has Version: dateSubmitted-002
issued: 2002-07-13
Date Modified: 2008-01-14

Improve Okular digital signature support
type: CompletedProject
type: Proposal
type: Project
proposal name: Improve Okular digital signature support
proposal status: Complete
proposal website: okular.kde.org
to fund: Assure Fund

XMPP-ActivityPub gateway
type: CompletedProject
type: Proposal
type: Project
proposal name: XMPP-ActivityPub gateway
proposal status: Complete
proposal website: salut-a-toi.org
to fund: Discovery Fund

Threat intelligence sharing
type: RunningProject
type: Proposal
type: Project
proposal name: Threat intelligence sharing
proposal status: Running
proposal website: www.stratosphereips.org
to fund: Entrust Fund

Pixelfed
type: RunningProject
type: Proposal
type: Project
proposal name: Pixelfed
proposal status: Running
proposal website: pixelfed.org
to fund: Entrust Fund

Node constraint component
type: Parameterizable
type: Constraint component
comment: A constraint component that can be used to verify that all value nodes conform to the given node shape.
parameter: NodeConstraintComponent-node

Accessible security
type: CompletedProject
type: Proposal
type: Project
proposal name: Accessible security
proposal status: Complete
proposal website: insurgo.ca
to fund: PET Fund

actor
type: Property
type: ObjectProperty
comment: Subproperty of as:attributedTo that identifies the primary actor
domain: Activity
range: Class
  unionOf: Object
  unionOf: Link
subPropertyOf: attributedTo

ListedLicense
type: Class
comment: A license which is included in the SPDX License List (http://spdx.org/licenses).
subclass of: License
subclass of: Class
  type: Restriction
  maxQualifiedCardinality: 1
  onDataRange: string
  onProperty: deprecatedVersion
subclass of: Class
  type: Restriction
  maxQualifiedCardinality: 1
  onDataRange: string
  onProperty: licenseTextHtml
subclass of: Class
  type: Restriction
  maxQualifiedCardinality: 1
  onDataRange: string
  onProperty: standardLicenseHeaderHtml
subclass of: Class
  type: Restriction
  maxQualifiedCardinality: 1
  onDataRange: boolean
  onProperty: isDeprecatedLicenseId
term status: stable

NodeKindConstraintComponent-nodeKind
type: Shape
type: Property shape
type: Parameter
in: Blank node
in: IRI
in: Literal
in: Blank node or IRI
in: Blank node or literal
in: IRI or literal
max count: 1
path: node kind

json-joy
type: RunningProject
type: Proposal
type: Project
proposal name: json-joy
proposal status: Running
proposal website: json-joy
to fund: Assure Fund

source constraint component
type: Property
comment: The constraint component that is the source of the result.
domain: Abstract result
range: Constraint component

Contributor
type: Property
comment: An entity responsible for making contributions to the resource.
range: Agent
subPropertyOf: Contributor
range includes: Agent
date: 2008-01-14
date: 2010-10-11
description: The guidelines for using names of persons or organizations as creators apply to contributors.
description: Examples of a Contributor include a person, an organization, or a service.
Relation: contributorT-001
Has Version: contributorT-001
issued: 2008-01-14
Date Modified: 2010-10-11

licenseComments
type: DatatypeProperty
type: Property
comment: The licenseComments property allows the preparer of the SPDX document to describe why the licensing in spdx:licenseConcluded was chosen.
domain: SpdxItem
term status: stable

packageVerificationCodeValue
type: DatatypeProperty
type: Property
comment: The actual package verification code as a hex encoded value.
domain: PackageVerificationCode
range: hexBinary
term status: stable

JavaScript constraint
type: Property
comment: Constraints expressed in JavaScript.
range: JavaScript-based constraint

Blank node
type: Node kind
comment: The node kind of all blank nodes.

Video
type: Class
comment: A Video document of any kind.
subclass of: Document

Creator
type: Property
comment: An entity responsible for making the resource.
comment: An entity primarily responsible for making the resource.
range: Agent
subPropertyOf: Creator
subPropertyOf: Contributor
range includes: Agent
date: 2010-10-11
date: 2008-01-14
description: Recommended practice is to identify the creator with a URI. If this is not possible or feasible, a literal value that identifies the creator may be provided.
description: Examples of a Creator include a person, an organization, or a service.
Relation: creatorT-002
Has Version: creatorT-002
issued: 2008-01-14
Date Modified: 2010-10-11
equivalentProperty: maker

licenseInfoFromFiles
type: ObjectProperty
type: Property
comment: The licensing information that was discovered directly within the package. There will be an instance of this property for each distinct value of alllicenseInfoInFile properties of all files contained in the package. If the licenseInfoFromFiles field is not present for a package and filesAnalyzed property for that same pacakge is true or omitted, it implies an equivalent meaning to NOASSERTION.
domain: Package
range: Class
  unionOf: AnyLicenseInfo
  unionOf: Class
    type: Restriction
    hasValue: noassertion
    onProperty: licenseInfoFromFiles
  unionOf: Class
    type: Restriction
    hasValue: none
    onProperty: licenseInfoFromFiles
term status: stable

Off-the-Record messaging version 4
type: Project
type: Proposal
type: CompletedProject
proposal name: Off-the-Record messaging version 4
proposal status: Complete
proposal website: Off-the-Record Messaging
proposal website: otr.im
to fund: PET Fund

p2panda: group encryption and capabilities
type: Proposal
type: Project
proposal name: p2panda: group encryption and capabilities
proposal status: Selected
proposal website: p2panda.org
to fund: Entrust Fund

betrusted
type: CompletedProject
type: Proposal
type: Project
proposal name: betrusted
proposal status: Complete
proposal website: betrusted.io
to fund: PET Fund

Prefix declaration
type: Class
comment: The class of prefix declarations, consisting of pairs of a prefix with a namespace.
subclass of: Resource

vdirsyncer
type: RunningProject
type: Proposal
type: Project
proposal name: vdirsyncer
proposal status: Running
proposal website: vdirsyncer
to fund: Entrust Fund

libnix
type: Proposal
type: Project
proposal name: libnix
proposal status: Selected
proposal website: nixos.org
to fund: Core Fund

packageName
type: Property
type: DatatypeProperty
comment: Identify the full name of the package as given by Package Originator.
domain: Package
subPropertyOf: name
term status: stable

Application
type: Class
comment: Represents a software application of any sort
subclass of: Object

relationshipType
type: ObjectProperty
type: Property
comment: Describes the type of relationship between two SPDX elements.
domain: Relationship
range: Class
  unionOf: Class
    type: Restriction
    hasValue: relationshipType amendment
    onProperty: relationshipType
  unionOf: Class
    type: Restriction
    hasValue: relationshipType ancestorOf
    onProperty: relationshipType
  unionOf: Class
    type: Restriction
    hasValue: relationshipType buildToolOf
    onProperty: relationshipType
  unionOf: Class
    type: Restriction
    hasValue: relationshipType containedBy
    onProperty: relationshipType
  unionOf: Class
    type: Restriction
    hasValue: relationshipType contains
    onProperty: relationshipType
  unionOf: Class
    type: Restriction
    hasValue: relationshipType copyOf
    onProperty: relationshipType
  unionOf: Class
    type: Restriction
    hasValue: relationshipType dataFile
    onProperty: relationshipType
  unionOf: Class
    type: Restriction
    hasValue: relationshipType dataFileOf
    onProperty: relationshipType
  unionOf: Class
    type: Restriction
    hasValue: relationshipType descendantOf
    onProperty: relationshipType
  unionOf: Class
    type: Restriction
    hasValue: relationshipType describedBy
    onProperty: relationshipType
  unionOf: Class
    type: Restriction
    hasValue: relationshipType describes
    onProperty: relationshipType
  unionOf: Class
    type: Restriction
    hasValue: relationshipType distributionArtifact
    onProperty: relationshipType
  unionOf: Class
    type: Restriction
    hasValue: relationshipType documentation
    onProperty: relationshipType
  unionOf: Class
    type: Restriction
    hasValue: relationshipType dynamicLink
    onProperty: relationshipType
  unionOf: Class
    type: Restriction
    hasValue: relationshipType expandedFromArchive
    onProperty: relationshipType
  unionOf: Class
    type: Restriction
    hasValue: relationshipType fileAdded
    onProperty: relationshipType
  unionOf: Class
    type: Restriction
    hasValue: relationshipType fileDeleted
    onProperty: relationshipType
  unionOf: Class
    type: Restriction
    hasValue: relationshipType fileModified
    onProperty: relationshipType
  unionOf: Class
    type: Restriction
    hasValue: relationshipType generatedFrom
    onProperty: relationshipType
  unionOf: Class
    type: Restriction
    hasValue: relationshipType generates
    onProperty: relationshipType
  unionOf: Class
    type: Restriction
    hasValue: relationshipType hasPrerequisite
    onProperty: relationshipType
  unionOf: Class
    type: Restriction
    hasValue: relationshipType metafileOf
    onProperty: relationshipType
  unionOf: Class
    type: Restriction
    hasValue: relationshipType optionalComponentOf
    onProperty: relationshipType
  unionOf: Class
    type: Restriction
    hasValue: relationshipType other
    onProperty: relationshipType
  unionOf: Class
    type: Restriction
    hasValue: relationshipType packageOf
    onProperty: relationshipType
  unionOf: Class
    type: Restriction
    hasValue: relationshipType patchApplied
    onProperty: relationshipType
  unionOf: Class
    type: Restriction
    hasValue: relationshipType patchFor
    onProperty: relationshipType
  unionOf: Class
    type: Restriction
    hasValue: relationshipType prerequisiteFor
    onProperty: relationshipType
  unionOf: Class
    type: Restriction
    hasValue: relationshipType staticLink
    onProperty: relationshipType
  unionOf: Class
    type: Restriction
    hasValue: relationshipType testcaseOf
    onProperty: relationshipType
  unionOf: Class
    type: Restriction
    hasValue: relationshipType variantOf
    onProperty: relationshipType
term status: stable

Data service
type: Class
comment: Un sito o end-point che fornisce operazioni relative alla scoperta, all'accesso o all'elaborazione di funzioni su dati o risorse correlate. @it
comment: Un sitio o end-point que provee operaciones relacionadas a funciones de descubrimiento, acceso, o procesamiento de datos o recursos relacionados. @es
comment: Et websted eller endpoint der udstiller operationer relateret til opdagelse af, adgang til eller behandlende funktioner på data eller relaterede ressourcer. @da
comment: Umístění či přístupový bod poskytující operace související s hledáním, přistupem k, či výkonem funkcí na datech či souvisejících zdrojích. @cs
comment: A site or end-point providing operations related to the discovery of, access to, or processing functions on, data or related resources.
label: Datatjeneste @da
label: Servicio de datos @es
label: Servizio di dati @it
subclass of: Catalogued resource
subclass of: Service
alternative label: Dataservice @da
change note: Nuova classe aggiunta in DCAT 2.0. @it
change note: Nueva clase añadida en DCAT 2.0. @es
change note: Ny klasse tilføjet i DCAT 2.0. @da
change note: Nová třída přidaná ve verzi DCAT 2.0. @cs
change note: New class added in DCAT 2.0.
definition: Et site eller endpoint der udstiller operationer relateret til opdagelse af, adgang til eller behandlende funktioner på data eller relaterede ressourcer. @da
scope note: Se un dcat:DataService è associato a uno o più Dataset specificati, questi sono indicati dalla proprietà dcat:serveDataset. @it
scope note: Datatjenestetypen kan indikeres ved hjælp af egenskaben dct:type. Værdien kan tages fra kontrollerede udfaldsrum såsom INSPIRE spatial data service vocabulary. @da
scope note: The kind of service can be indicated using the dct:type property. Its value may be taken from a controlled vocabulary such as the INSPIRE spatial data service type vocabulary.
scope note: Pokud je dcat:DataService navázána na jednu či více Datových sad, jsou tyto indikovány vlstností dcat:servesDataset. @cs
scope note: Il tipo di servizio può essere indicato usando la proprietà dct:type. Il suo valore può essere preso da un vocabolario controllato come il vocabolario dei tipi di servizi per dati spaziali di INSPIRE. @it
scope note: Si un dcat:DataService está asociado con uno o más conjuntos de datos especificados, dichos conjuntos de datos pueden indicarse con la propiedad dcat:servesDataset. @es
scope note: If a dcat:DataService is bound to one or more specified Datasets, they are indicated by the dcat:servesDataset property.
scope note: Druh služby může být indikován vlastností dct:type. Její hodnota může být z řízeného slovníku, kterým je například slovník typů prostorových datových služeb INSPIRE. @cs
scope note: Hvis en dcat:DataService er bundet til en eller flere specifikke datasæt kan dette indikeres ved hjælp af egenskaben dcat:servesDataset. @da
scope note: El tipo de servicio puede indicarse usando la propiedad dct:type. Su valor puede provenir de un vocabulario controlado, como por ejemplo el vocabulario de servicios de datos espaciales de INSPIRE. @es

Web Annotation
type: CompletedProject
type: Proposal
type: Project
proposal name: Web Annotation
proposal status: Complete
proposal website: annotator.apache.org
to fund: Discovery Fund

SCION-enabled IPFS and libp2p
type: Proposal
type: Project
proposal name: SCION-enabled IPFS and libp2p
proposal status: Selected
proposal website: www.netsys.ovgu.de
to fund: Core Fund

order
type: Property
comment: Specifies the relative order of this compared to its siblings. For example use 0 for the first, 1 for the second.

relationshipType packageOf
type: RelationshipType
type: Thing
type: NamedIndividual
comment: To be used when SPDXRef-A is used as a package as part of SPDXRef-B.
term status: stable

urn:…
commit author name: streamich
commit time: 1599069880

urn:…
commit author name: Michał 'rysiek' Woźniak
commit time: 1617729517

mastodon
author emails: harvest-extract.jsonld
author names: tateisu
author names: Sumit Khanna
author names: febrezo
author names: Korbinian
author names: nzws
author names: Skyler Hawthorne
author names: emilweth
author names: Lukas Martini
author names: 西小倉宏信
author names: ヨイツの賢狼ホロ | 3rd style
author names: Matt
author names: TheInventrix
author names: NecroTechno
author names: ふるふる
author names: Andrea Scarpino
author names: Thijs Kinkhorst
author names: renovate[bot]
author names: Gabriel Rubens
author names: Wolfgang Fournès
author names: namelessGonbai
author names: Eai
author names: goofy-bz
author names: Oskari Noppa
author names: helloworldstack
author names: Hampton Lintorn-Catlin
author names: Samruddhi Khandale
author names: Denis Teyssier
author names: Remi Rampin
author names: Wenceslao Páez Chávez
author names: ふぁぼ原
author names: Nicolas Hoffmann
author names: StefOfficiel
author names: tackeyy
author names: OSAMU SATO
author names: Toshiyuki Takahashi
author names: Neil Matatall
author names: KY
author names: Drew Schuster
author names: Даниил Пронин
author names: Amakasu Ryoma
author names: JakePaustian
author names: Eugen
author names: TheKinrar
author names: s0
author names: M Somerville
author names: Christian Winther
author names: hoodie
author names: Andrew Zyabin
author names: Yusuke Abe
author names: YOU
author names: Rens Groothuijsen
author names: Neil Moore
author names: Akinori MUSHA
author names: fuyu
author names: Jennifer Kruse
author names: alpaca-tc
author names: K.SHIRAKASHI
author names: りんすき
author names: Rob Thomas
author names: Gomasy
author names: Clar Fon
author names: Jasmin Johal
author names: Milan
author names: Aleks Xhuvani
author names: Stephen Burgess
author names: maxypy
author names: usagi-f
author names: Ornithologist Coder
author names: Partho Ghosh
author names: neetshin
author names: Heitor de Melo Cardozo
author names: Peter
author names: Yamagishi Kazutoshi
author names: Jean byroot Boussier
author names: BSKY
author names: Jérémy Benoist
author names: Erik Sundell
author names: Alison Wheeler
author names: YMHuang

urn:…
commit author name: Laurent Savaëte
commit time: 1709563788

urn:…
commit author name: dependabot[bot]
commit time: 1710842106

android
author names: dianlujitao
author names: Jason Riordan
author names: zeeshanhussain
author names: Bruno Martins
author names: Michael Bestas
author names: Alexander Martinz
author names: weldoncyngn
author names: Tanguy Pruvot
author names: Alessandro
author names: razorloves
author names: Daniel Jacob Chittoor
author names: Trevor Drake
author names: Olivier Karasangabo
author names: Uldiniad
author names: Sam Mortimer
author names: kostoulhs
author names: Abhisek Devkota
author names: XpLoDWilD
author names: Rohit R Sekhar
author names: cretin45
author names: DroidFreak32
author names: Andy Mast
author names: Neil Fuller
author names: SamarV-121
author names: dhacker29
author names: Jan Altensen
author names: Georg Veichtlbauer
author names: Pig
author names: Gary Kipnis
author names: Howard M. Harte
author names: Scott Mertz
author names: Dušan Šušić
author names: Sebastiano Barezzi
author names: Arian
author names: Peter Cai
author names: PIPIPIG233666
author names: Tom Giordano
author names: codeworkx
author names: Ethan Chen
author names: Diogo Ferreira
author names: Bharath
author names: Romain Hunault
author names: Luca Stefani
author names: Ashwin
author names: Dan Pasanen
author names: Scott Warner
author names: Nishith Khanna
author names: percy-g2
author names: Tony Layher
author names: Brint E. Kriebel
author names: Oliver Scott
author names: Jessica Wagantall
author names: Jonathan Bensen
author names: Aaron Kling
author names: Rashed Abdel-Tawab
author names: Mohd Faraz
author names: LuK1337
author names: gabrielgagz
author names: Les Prock
author names: Henning Nielsen Lund
author names: Matt Wagantall
author names: Kevin F. Haggerty
author names: Hashbang173
author names: Darshan Manjrekar
author names: José Adolfo Galdámez
author names: Brin Taylor
author names: Mohammed Althaf Thayyil
author names: Chirayu Desai
author names: Han Wang
author names: Neil Perry
author names: Michael W
author names: Shane Passmore
author names: Simon Davie
author names: SferaDev
author names: Hashcode
author names: Pawit Pornkitprasan
author names: Nolen Johnson
author names: Christopher N. Hesse
author names: Alexander Koskovich
author names: Hriday Sharma

urn:…
commit author name: Thilo Molitor
commit time: 1693142615

urn:…
commit author name: Turbobot
commit time: 1694433337

urn:…
commit author name: Karolin Varner
commit time: 1677181556

urn:…
commit author name: Eugen Rochko
commit time: 1456005200

secsync
author names: Nik Graf
default branch: main
number of commits: 145

urn:…
commit author name: XAMPPRocky
commit time: 1710668767

urn:…
commit author name: Nik Graf
commit time: 1640153421

urn:…
commit author name: l10n daemon script
commit time: 1710730073

urn:…
commit author name: Hannes Mehnert
commit time: 1710438808

urn:…
commit author name: DavHau
commit time: 1630683052

urn:…
commit author name: Armijn Hemel
commit time: 1703349372

doipjs
author names: Dario Vladovic
author names: Preston Maness
author names: Yarmo Mackenbach
default branch: dev
number of commits: 630

PeARS-lite
author names: Hrishi
author names: minimalparts
author names: Gosse Minnema
default branch: main
number of commits: 49

urn:…
commit author name: Erin Power
commit time: 1580169238

urn:…
commit author name: Yarmo Mackenbach
commit time: 1706803600

urn:…
commit author name: Damian Poddebniak
commit time: 1585835592

urn:…
commit author name: Uros Majstorovic
commit time: 1707095646

dada-core
author names: Pascal Romain
author names: Laurent Savaëte
author names: Pierre Chrzanowski
author names: akakeronos
author names: Edlira Nano (Eda)
author names: pzwsk
author names: Laurent Savaete
author names: laurentS
default branch: master
number of commits: 242

re-Isearch
author names: Edward Zimmermann
author names: Edward C. Zimmermann
default branch: master
number of commits: 250

urn:…
commit author name: Sebastian
commit time: 1710904769

miragevpn
author names: Calascibetta Romain
author names: whohoho
author names: Hannes Mehnert
author names: Your Name
author names: Reynir Björnsson
author names: Robur
author names: C For C's Sake
default branch: main
number of commits: 339

oqs-provider
author names: PI
author names: Mouse
author names: Shuusui
author names: thb-sb
author names: qnfm
author names: Bence Mali
author names: dependabot[bot]
author names: Dmitry Belyavskiy
author names: Michael Baentsch
author names: Mark Wooding
author names: VeronikaNguyen
author names: Alex Zaslavsky
author names: Michael
author names: marcbrevoort-cyberhive
author names: Paul Schweigert
author names: thomas
author names: Felipe Ventura
author names: Basil Hess
author names: Nigel Jones
author names: Will Childs-Klein
author names: Spencer Wilson
author names: Richard Levitte
author names: Mariam John
author names: Alex Bozarth
default branch: main
number of commits: 194

dream2nix
author names: f
author names: Ilan Joselevich
author names: Yusuf Bera Ertan
author names: Robert Hensing
author names: adisbladis
author names: InLaw
author names: dependabot[bot]
author names: DavHau
author names: Paul Haerle
author names: hsjobeki
author names: rubyowo
author names: Mihai Fufezan
author names: Johannes Kirschbauer
author names: Grégoire Geis
author names: Frederik Rietdijk
author names: t4ccer
author names: Andrea Ciceri
author names: phaer
author names: purepani
author names: waalge
author names: Arnout Engelen
author names: Jairo Llopis
author names: olaf
author names: Vincent Vanlaer
author names: Ryan Gibb
author names: Gérald Lelong
author names: Florian Friesdorf
author names: dusk
author names: github-actions[bot]
author names: Sridhar Ratnakumar
author names: Yueh-Shun Li
author names: Herman Fries
default branch: main
number of commits: 1042

urn:…
commit author name: Nikolay Bogoychev
commit time: 1695217299

cryptolyzer
author names: Szilárd Pfeiffer
default branch: master
number of commits: 352

urn:…
commit author name: The Android Open Source Project
commit time: 1316190601

pmaports
author names: uclydde
author names: Olgierd Nowakowski
author names: Minecrell
author names: M0Rf30
author names: Gianluca Boiano
author names: niko
author names: thejsa
author names: Maxnet
author names: Joel Selvaraj
author names: Monu Kumar
author names: David Wronek
author names: bjorn3
author names: Akash Rawat
author names: Andreas Kemnade
author names: Tito Ragusa
author names: BogdanTheGeek
author names: Théo Friberg
author names: SDM845 CI
author names: Elliot Huang
author names: ajakk
author names: Angus Gibson
author names: eli
author names: Niklas Cathor
author names: Paper
author names: shwsh
author names: Alex Roth
author names: Siddharth Manthan
author names: Rian McGuire
author names: jianhua000
author names: K-laus
author names: Arnav Bhatt
author names: Ruby Iris Juric
author names: Maxim Karasev
author names: notfound405
author names: Mark Hargreaves
author names: foldedcascode
author names: RONTheCookie
author names: David W
author names: blacksilver
author names: Fiona Klute
author names: Timothee LF
author names: Newbyte
author names: Miles Alan
author names: Martin Lillepuu
author names: bhuvi
author names: BO41
author names: Craig Comstock
author names: unxcepted
author names: markochk
author names: Pedro Ângelo
author names: Stacy Harper
author names: Serge Hallyn
author names: Björgvin Ragnarsson
author names: sir_si
author names: Mithil Bavishi
author names: kf
author names: Alper Nebi Yasak
author names: Rogier Oudshoorn
author names: Michal Vasilek
author names: Свободные Мобильные Технология
author names: Dyna
author names: Ferenc Bakonyi
author names: deata
author names: Mayeul Cantan
author names: Rudy
author names: magnouvean
author names: Dave Young
author names: Jonas Fentker
author names: Gaëtan André
author names: myfreeweb
author names: djyee
author names: Sporos
author names: Amy Grace
author names: xtex
author names: lazzardo
author names: Jean THOMAS
author names: Lucid One
author names: Stefan Strogin
author names: Oleg Chernovskiy
author names: Jane Rachinger

urn:…
commit author name: Brett Sheffield
commit time: 1479758093

nextpnr-xilinx
author names: Miodrag Milanovic
author names: Hans Baier
author names: Serge Bazanski
author names: myrtle
author names: ZipCPU
author names: gatecat
author names: Sergiusz Bazanski
author names: David Shah
author names: Eddie Hung
author names: Miodrag Milanović
author names: Clifford Wolf
default branch: stable-backports
number of commits: 1273

urn:…
commit author name: Szilárd Pfeiffer
commit time: 1710006791

keyoxide-flutter
author names: Berker Sen
author names: Seferi
author names: Berker
author names: Yarmo Mackenbach
default branch: master
number of commits: 279

urn:…
commit author name: Oliver Smith
commit time: 1495830385

urn:…
commit author name: Nik Graf
commit time: 1700752060

ProveThis
author names: rockhouse
default branch: main
number of commits: 1

kdeconnect-android
author names: Albert Astals Cid
author names: Arjun Thekoot Harisankar
author names: Okoko Michaels
author names: Vincent Blücher
author names: Jing Xia
author names: Felix Fischer
author names: Tobias Fella
author names: Mikhail Ivchenko
author names: Wojciech M
author names: Job Noorman
author names: Trevor Terris
author names: Mauro Panzeri
author names: Ankit Bhardwaj
author names: Ilmaz Gumerov
author names: Titir Adhikary
author names: Antoni Bella Pérez
author names: Chris Holland
author names: Sourav Das
author names: Matteo Princisgh
author names: Matthew Mirvish
author names: Sohny Bohny
author names: Rahil Momin
author names: l10n daemon script
author names: Julian Wolff
author names: Manuel Jesús de la Fuente
author names: Mikhail Zolotukhin
author names: Yuri Chornoivan
author names: Pino Toscano
author names: Mitja Cotic
author names: Saikrishna Arcot
author names: Isira Seneviratne
author names: Rob Emery
author names: Maxim Leshchenko
author names: Éric Gillet
author names: Àlex Fiestas
author names: Łukasz Patron
author names: Pluto Hu
author names: Daniel Tang
author names: Nishith Khanna
author names: Vineet Garg
author names: Ash Holland
author names: Aniket Kumar
author names: Dmitriy Bogdanov
author names: Julius Künzel
author names: Lennart Siefke
author names: Yannik Sembritzki
author names: George Hopkins
author names: Sylvia van Os
author names: Aleix Pol
author names: Aditya Mehra
author names: Axel Pirek
author names: Joscha Henningsen
author names: Daniel Weigl
author names: Albert Vaca Cintora
author names: Arun Parolikkal
author names: Matthijs Tijink
author names: Gobinath A L
author names: Kai Dombrowe
author names: Achilleas Koutsou
author names: Luigi Toscano
author names: Pinak Ahuja
author names: Harry Cheng
author names: Michael Hathaway
author names: Richard Wagler
author names: Da-Jin Chu
author names: Piyush Aggarwal
author names: Nicolas Fella
author names: Colin Redman
author names: Ajay Choudhary
author names: Art Pinch
author names: Karl Heinz
author names: Dmitry Yudin
author names: Chansol Yang
author names: Zixing Liu
author names: Albert Vaca
author names: Wojciech Matuszewski
author names: Abdel-Rahman Abdel-Rahman
author names: Bacteria Dev
author names: Kai Uwe Broulik
author names: Krut Patel

urn:…
commit author name: Szilárd Pfeiffer
commit time: 1554044032

urn:…
commit author name: mcodescu
commit time: 1709406435

librecast
author names: Brett Sheffield
author names: Vagrant Cascadian
author names: Justin Vreeland
author names: Brett A C Sheffield
author names: Claudio Calvelli
author names: Uilebheist
default branch: main
number of commits: 1085

talentlayer-sdk
author names: Pranav Singhal
author names: Turbobot
author names: Romain
author names: pranavsinghal
author names: 0xRomain
author names: Quentin
default branch: develop
number of commits: 71

urn:…
commit author name: Vula Author 1
commit time: 1706882163

urn:…
commit author name: George Svarovsky
commit time: 1702220587

urn:…
commit author name: André Jaenisch
commit time: 1707849869

urn:…
commit author name: Michael Meeks
commit time: 1425464717

urn:…
commit author name: Jillian
commit time: 1372348592

urn:…
commit author name: Justus Tumacder
commit time: 1650333287

statime
author names: Bram Tweedegolf
author names: Dmitry Sharshakov
author names: dependabot[bot]
author names: Henk Oordt
author names: Ruben Nijveld
author names: Folkert
author names: marlonp
author names: someone
author names: David Venhoek
author names: Erik Jonkers
author names: Tamme Dittrich
author names: Folkert de Vries
author names: Dion Dokter
author names: Rick van der Wal
author names: LisetRoos
author names: Mike English
author names: diondokter
author names: Marlon Peeters
author names: MP
default branch: main
number of commits: 530

urn:…
commit author name: Yarmo Mackenbach
commit time: 1696403985

translateLocally
author names: Kenneth Heafield
author names: XapaJIaMnu
author names: Jelmer van der Linde
author names: pacien
author names: Jelmer
author names: Nikolay Bogoychev
default branch: master
number of commits: 224

urn:…
commit author name: Damian Poddebniak
commit time: 1710635836

urn:…
commit author name: minimalparts
commit time: 1704371061

urn:…
commit author name: Your Name
commit time: 1553130439

urn:…
commit author name: Alex Zolotarev
commit time: 1442950437

urn:…
commit author name: David Venhoek
commit time: 1641288676

urn:…
commit author name: Edward C. Zimmermann
commit time: 1624636494

urn:…
commit author name: rockhouse
commit time: 1692175839

urn:…
commit author name: Pavol Mederly
commit time: 1710964897

mikroPhone
author names: Uros Majstorovic
default branch: master
number of commits: 469

urn:…
commit author name: waldenn
commit time: 1710677544

swh-deposit
author names: vlorentz
author names: moranegg
author names: Pratyush Desai
author names: Stefano Zacchiroli
author names: Antoine Pietri
author names: Ishan Bhanuka
author names: Valentin Lorentz
author names: David Douard
author names: Morane Otilia Gruenpeter
author names: Nicolas Dandrimont
author names: Raphaël Gomès
author names: Jérémy Bobbio (Lunar)
author names: Antoine R. Dumont (@ardumont)
author names: Antoine Lambert
author names: Benoit Chauvet
default branch: master
number of commits: 1097

urn:…
commit author name: Tillmann
commit time: 1710859182

urn:…
commit author name: Brett A C Sheffield
commit time: 1701168193

urn:…
commit author name: /e/ robot
commit time: 1709993831

urn:…
commit author name: Kristina Sojakova
commit time: 1658859444

urn:…
commit author name: Chocobozzz
commit time: 1581590943

urn:…
commit author name: Trammell Hudson
commit time: 1469451996

conzept
author names: Jama
author names: waldenn
author names: Your Name
default branch: master
number of commits: 607

urn:…
commit author name: minimalparts
commit time: 1684747249

urn:…
commit author name: Salif Mehmed
commit time: 1707470066

keyoxide-spec
author names: Yarmo Mackenbach
default branch: main
number of commits: 20

urn:…
commit author name: github-actions[bot]
commit time: 1710873088

ari
author names: Kira Bruneau
default branch: main
number of commits: 94

IPDL-Maude
author names: mcodescu
author names: Kristina Sojakova
default branch: main
number of commits: 129

urn:…
commit author name: Raymond Hackley
commit time: 1710840512

urn:…
commit author name: Willem Toorop
commit time: 1490106083

urn:…
commit author name: Kira Bruneau
commit time: 1703823536

urn:…
commit author name: Seferi
commit time: 1634153203

urn:…
commit author name: Clifford Wolf
commit time: 1527068149

midpoint
author names: Richard "Virgo" Richter
author names: Tony Tkacik
author names: ogz00
author names: lskublik
author names: petr.gasparik
author names: Michal Serbak
author names: Petr Gašparík
author names: skublik
author names: gpalos
author names: Richard Richter
author names: Slavek Licehammer
author names: jmederly
author names: KateHonchar
author names: mamut
author names: Misagh Moayyed
author names: virgo47
author names: Lukas Skublik
author names: matus
author names: Pavol Mederly
author names: Martin Lizner
author names: Hiroyuki Wada
author names: Gabriela Polcova
author names: Martin Lízner
author names: KaterynaHonchar
author names: Brandon Powers
author names: Katarina Valalikova
author names: Kateryna Honchar
author names: Kristof
author names: Martin Spanik
author names: erik
author names: unknown
author names: Viliam Repan
author names: Radovan Semancik
author names: Erik Suta
author names: Sabria
author names: kate
author names: Katarina Valalikova (katkav)
author names: Ivan Noris
author names: Tony Tkáčik
author names: Igor Farinic
author names: garbika
author names: katkav
author names: Kristian
author names: tchrapovic
author names: honchar
author names: Peter Prochazka
author names: mmacik
author names: Sabri
author names: Patrik
default branch: master
number of commits: 13189

urn:…
commit author name: Hans Baier
commit time: 1708318678

rosenpass
author names: Dimitris Apostolou
author names: alankritdabral_2
author names: Ashish SHUKLA
author names: Paul Spooren
author names: Aaron Kaiser
author names: Karolin Varner
author names: Benjamin Lipp
author names: wucke13
author names: Marek Küthe
author names: Marei (peiTeX)
author names: Ilka Schulz
author names: Steffen Vogel
author names: Morgan Hill
author names: timothy mellor
author names: James Brownlee
author names: Ezhil Shanmugham
author names: Jemilu Mohammed
author names: ajuvo
author names: Emil Engler
author names: Mullana
author names: Olaf Pichler
default branch: main
number of commits: 220

urn:…
commit author name: Berker
commit time: 1709733799

connectbyname
author names: Willem Toorop
author names: George Thessalonikefs
author names: Philip-NLnetLabs
author names: Philip Homburg
default branch: master
number of commits: 52

urn:…
commit author name: D. Reusche
commit time: 1682501651

urn:…
commit author name: Antoine R. Dumont (@ardumont)
commit time: 1495183598

proximity matcher webservice
author names: Armijn Hemel
default branch: main
number of commits: 74

Monal
author names: Boris Wachtmeister
author names: Your Name
author names: Nathan
author names: Thilo Molitor
author names: Jim
author names: Friedrich Altheide
author names: Freie Messenger
author names: mondstern
author names: janst97
author names: angelina-p09
author names: nautilusx
author names: CC
author names: tmolitor-stud-tu
author names: anurodhp
author names: Jim Tsai
author names: Wise
author names: Jan Stoyke
author names: Daniel Aleksandersen
author names: Artem
author names: Aktilor
author names: sirdrakeistda
author names: ButterflyOfFire
author names: Echolon
author names: J. Lavoie
author names: JimTsai
author names: Weblate (bot)
author names: foss-
author names: Licaon Kter
author names: Anu Pokharel
author names: Kim Alvefur
author names: Anurodh Pokharel
default branch: develop
number of commits: 5454

m-ld-js
author names: Petra Jaros
author names: George Svarovsky
default branch: edge
number of commits: 249

winden
author names: Andreas Wuerl
author names: Andreas Würl
author names: dependabot[bot]
author names: b3n
author names: Justus Tumacder
author names: Ramakrishnan Muthukrishnan
author names: on-ba
author names: Donatas Puidokas
default branch: main
number of commits: 201

my2sec
author names: Elisa Riforgiato
author names: Luca Roffia
author names: Gianluca Di Tuccio
author names: GregorioMonari
default branch: main
number of commits: 54

urn:…
commit author name: Yarmo Mackenbach
commit time: 1593100866

keyoxide-web
author names: Yarmo Mackenbach
author names: Dasheroo
author names: André Jaenisch
author names: Preston Maness
author names: yarmo
default branch: dev
number of commits: 852

heads
author names: Jason Blackwell
author names: Markus Meissner
author names: iseeareddoor
author names: tslil clingman
author names: Johan Grip
author names: Matt DeVillier
author names: amaloteaux
author names: Marek Marczykowski-Górecki
author names: MrChromebox
author names: icequbes1
author names: Trammell Hudson
author names: JonathonHall-Purism
author names: HardenedVault
author names: Tom Hiller
author names: Sebastian McMillan
author names: Thierry Laurion
author names: Paul Menzel
author names: Trammell hudson
author names: Martin Kepplinger
author names: Patrick Rudolph
author names: eganonoa
author names: Nathan Rennie-Waldock
author names: Kyle Rankin
author names: natterangell
author names: Francis Lam
author names: Jonathon Hall
author names: tlaurion
default branch: master
number of commits: 1007

rasn
author names: messense
author names: Piotr Zaczkowski
author names: Niklas Saari
author names: Alexandr Kitaev
author names: David Craven
author names: memoryruins
author names: Konrad Lipinski
author names: Dmitry Pankratov
author names: Masih Yeganeh
author names: Curtis Lee Fulton
author names: Wiktor Kwapisiewicz
author names: Kyle
author names: Julian Satchell
author names: Kyle Schaffrick
author names: Matt Sunderland
author names: 6d7a
author names: Yerkebulan Tulibergenov
author names: Chris Moos
author names: delfino
author names: Konge
author names: andrew lyon
author names: rodrimati1992
author names: Benedikt Radtke
author names: Wesley Norris
author names: XAMPPRocky
author names: Ben Maddison
author names: github-actions[bot]
author names: Dan Dumont
author names: Andrew Danger Lyon
author names: Frank Horvath
author names: Chris Greenaway
author names: Erin Power
default branch: main
number of commits: 352

urn:…
commit author name: Michał "rysiek" Woźniak
commit time: 1710374687

urn:…
commit author name: Albert Vaca
commit time: 1370491026

urn:…
commit author name: Yarmo Mackenbach
commit time: 1603485353

aboutcode-toolkit
author names: Kevin Tran
author names: Michael Herzog
author names: Jillian Daguil
author names: Chin Yeung
author names: Chin Yeung Li
author names: Dennis Clark
author names: tdruez
author names: pombredanne
author names: CYL
author names: Jono Yang
author names: Philippe Ombredanne
author names: Jillian
default branch: develop
number of commits: 858

imap-codec
author names: Gary Guo
author names: Franziskus Kiefer
author names: dependabot[bot]
author names: Cyan Yan
author names: Damian Poddebniak
author names: FelixPodint
author names: Jakob Schikowski
default branch: main
number of commits: 907

urn:…
commit author name: Kira Bruneau
commit time: 1661212543

urn:…
commit author name: Razvan Stoenescu
commit time: 1563008978

urn:…
commit author name: Peter Prochazka
commit time: 1305034515

urn:…
commit author name: Armijn Hemel
commit time: 1645359185

urn:…
commit author name: Philip Homburg
commit time: 1673267964

urn:…
commit author name: Luca Roffia
commit time: 1651662083

urn:…
commit author name: anurodhp
commit time: 1301340898

urn:…
commit author name: Antoine Lambert
commit time: 1707146046

urn:…
commit author name: Your Name
commit time: 1640287561

urn:…
commit author name: Nikolay Bogoychev
commit time: 1618322523

urn:…
commit author name: Yarmo Mackenbach
commit time: 1667242161

vula
author names: Vula Author 2
author names: vula
author names: Appelbaum Jacob
author names: Vula Authors
author names: Leif Ryge
author names: Vula Author 1
default branch: main
number of commits: 98

urn:…
commit author name: Florian Dold
commit time: 1448480796

urn:…
commit author name: Chin Yeung
commit time: 1709535977

urn:…
commit author name: 0xRomain
commit time: 1709567353

json-joy
author names: Va Da
author names: Vadim Dalecky
author names: semantic-release-bot
author names: renovate[bot]
author names: Vadims Daleckis
author names: streamich
default branch: master
number of commits: 395

urn:…
commit author name: Luke Kenneth Casson Leighton
commit time: 1549788647

urn:…
commit author name: Uros Majstorovic
commit time: 1493838608

urn:…
commit author name: GregorioMonari
commit time: 1687445544

soc.git
author names: Raptor Engineering Development Team
author names: Andrey Miroshnikov
author names: Yehowshua Immanuel
author names: Jonathan Neuschäfer
author names: rishucoding
author names: Luke Kenneth Casson Leighton
author names: Cesar Strauss
author names: isengaara
author names: Jacob Lifshay
author names: Cole Poirier
author names: Samuel A. Falvo II
author names: Staf Verhaegen
author names: colepoirier
author names: klehman
author names: Michael Nolan
author names: Tobias Platen
author names: Las Safin
author names: Daniel Benusovich
default branch: master
number of commits: 5243

online
author names: Ozcan Esen
author names: Gökay Şatır
author names: Jason Clermont
author names: pootlebot automatic
author names: Reza Almanda
author names: Jean Mareilles
author names: Marco Cecchetti
author names: Corentin Noël
author names: Quentin PAGÈS
author names: Emre Öztürk
author names: Oğuz Ersen
author names: Andrej Shadura
author names: Andreas-Kainz
author names: Rizal Muttaqin
author names: bgbenzer
author names: Ashod Nakashian
author names: Allan Nordhøy
author names: Jan Holesovsky
author names: lpwxyz
author names: Mehmet Sait Gülmez
author names: Harsh Gohel
author names: Pedro Silva
author names: ihristova11
author names: Yunusemre Şentürk
author names: bruh
author names: Areg Nakashian
author names: Software In Interlingua
author names: 이정희
author names: Scott Clarke
author names: Mücahid Aydin
author names: Eugenia Russell
author names: koffevar
author names: Petri Heinämäki
author names: Akhlak Ahmad
author names: Roman Kirilenko
author names: Çağrı Gökçe
author names: László Németh
author names: Zeki Tuman
author names: Ram
author names: Andika Triwidada
author names: Rajasekaran Karunanithi
author names: Thomas Citharel
author names: George
author names: phlostically
author names: Sabri Ünal
author names: Timur Gadžo
author names: K. Herbert
author names: Ralf Becker
author names: Nathan
author names: Luna Jernberg
author names: SC
author names: Darshan Upadhyay
author names: Flavio F. M
author names: Shehr Bano
author names: Stanislav Horáček
author names: Thomas Lehmann
author names: Tex2002ans
author names: Sven Strickroth
author names: Hillwood Yang
author names: YadlaMani
author names: Balázs Varga (allotropia)
author names: Martin Hoffmann
author names: M.-Kupriyanov
author names: pelinKuran
author names: Giacomo Bertolotti
author names: Naveen
author names: Jan-Marek Glogowski
author names: stellarpower
author names: abidin toumi
author names: PhD. Ayhan YALÇINSOY
author names: Subham Jena
author names: Iván Sánchez Ortega
author names: Сергій
author names: Marc Rodrigues
author names: Artyom Sovetnikov
author names: HelaBasa
author names: Muhammet Kara
author names: Luka Trovic
author names: William Gathoye
author names: Abdelsattar Tantawy

urn:…
commit author name: Richard Levitte
commit time: 1611915472

urn:…
commit author name: Jonathon Hall
commit time: 1708712553

dist-mech-learn
author names: Daniel Reusche
author names: D. Reusche
default branch: main
number of commits: 11

urn:…
commit author name: Matt Jankowski
commit time: 1710864670

urn:…
commit author name: Cesar Strauss
commit time: 1699193920

wallet-core.git
author names: L
author names: Iván Ávalos
author names: Tim Vutor
author names: Sebastian Marchano
author names: Mikolai Gütschow
author names: ms
author names: José Huamán
author names: Ilya Kowalewski
author names: Michiel Leenaars
author names: Jeff Burdges
author names: ng0
author names: Torsten Grote
author names: Midgard
author names: Thien-Thi Nguyen
author names: Jeffrey Burdges
author names: Anonymous
author names: Stefan
author names: Özgür Kesim
author names: tg(x)
author names: Javier Sepulveda
author names: Marc Stibane
author names: Boss Marco
author names: Marco Boss
author names: d0p1
author names: Nic Eigel
author names: Gian Demarmels
author names: Sebastian
author names: Marcos Gutierrez
author names: Christian Grothoff
author names: Marcello Stanisci
author names: Saul Palomino Ramos
author names: Florian Dold
author names: MS
author names: Stefan Kügel
author names: Alp
author names: Jonathan Buchanan
author names: Devan Carpenter
author names: Krystian Baran
default branch: master
number of commits: 4753

urn:…
commit author name: Edward Zimmermann
commit time: 1681419477

urn:…
commit author name: b3n
commit time: 1707126619

urn:…
commit author name: Vula Authors
commit time: 1617657094

urn:…
commit author name: Paul Spooren
commit time: 1710268107

tauri
author names: Dan
author names: dswd
author names: Jingyu
author names: Ngo Iok Ui
author names: Antoine Meloche
author names: Newbyte
author names: tweidinger
author names: Chris Ohk
author names: Sporesirius
author names: Josh Soref
author names: Gökçe Merdun
author names: Elliot Waite
author names: nbro
author names: dependabot[bot]
author names: pwespi
author names: Jonathan Dizdarevic
author names: Zak Patterson
author names: martin frances
author names: TomScavo
author names: Orvar Segerström
author names: DeemoDing
author names: Vinícius Miguel
author names: Friedel Ziegelmayer
author names: Nathanael Rea
author names: fossabot
author names: Antoine Chauvin
author names: Miniontoby
author names: amrbashir
author names: Christian W. Zuckschwerdt
author names: Dimitris Apostolou
author names: Adrian Hupka
author names: Mateo Gallardo
author names: Pankaj Patil
author names: thewh1teagle
author names: yydcnjjw
author names: up-to-you
author names: luofei
author names: kandrelczyk
author names: Ikko Ashimine
author names: Fabian-Lars
author names: Alain Nicolas Schneble
author names: Tnze
author names: Kris Krolak
author names: Danil Karpenko
author names: Eric Veilleux
author names: Amr Bashir
author names: Oscar Beaumont
author names: Jason
author names: Lucas
author names: Anish Prashun
author names: Joaquín
author names: Justin Syme
author names: Michał Sidor
author names: Daniel Thompson-Yvetot
author names: Anil Kumar
author names: Md. Fahim Bin Amin
author names: icedrocket
author names: Davide Baldo
author names: ChAyLom
author names: MentalGear
author names: hanaTsuk1
author names: Aivan Monceller
author names: canxin
author names: Razvan Stoenescu
author names: Tensor-Programming
author names: thep0y
author names: nothingismagick
author names: Philipp Bokatius
author names: shniubobo
author names: Jake Stanger
author names: Aitor Miguel Blanco
author names: Risto Stevcev
author names: Kárándi Tamás
author names: Thad Guidry
author names: Dotan J. Nahum
author names: f91kdash
author names: KurikoMoe
author names: Kasper
author names: Kris Scott
author names: Akirami

urn:…
commit author name: Szymon Kłos
commit time: 1710866364

urn:…
commit author name: Alexander Borsuk
commit time: 1710823454

urn:…
commit author name: George Svarovsky
commit time: 1574005374

urn:…
commit author name: thomas
commit time: 1710852342

urn:…
commit author name: Va Da
commit time: 1710877107

libresilient
author names: Michał 'rysiek' Woźniak
author names: Michał "rysiek" Woźniak
default branch: master
number of commits: 214

urn:…
commit author name: laurentS
commit time: 1555078444

urn:…
commit author name: Daniel Reusche
commit time: 1605202944

search-index
author names: Chocobozzz
author names: Ihor Hordiichuk
author names: Joan Francés Blanc
author names: Pedro
author names: Siourdakis Thanos
author names: Berto Te
author names: Jorge Paulo Malveira Pimentel Dos Santos
author names: Filip Bengtsson
author names: Dimitrios Glentadakis
author names: GunChleoc
author names: Unetelle Inconnue
author names: DignifiedSilence
author names: Milo Ivir
author names: Mohamad Reza
author names: Дмитрий Кузнецов
author names: Rigel Kent
author names: chocobozzz
author names: Phongpanot
author names: josé m
author names: Marcin Mikołajczak
author names: Arco
author names: Petr Balíček
author names: Vodoyo Kamal
author names: Quentin PAGÈS
author names: lost_geographer
author names: 0que
author names: José M
author names: imgradeone Yan
author names: Vri
author names: Jiri Podhorecky
author names: qwerty
author names: LibreHacker
author names: Besnik Bleta
author names: Rostyslav Haitkulov
author names: Salif Mehmed
author names: nexi
author names: TA
author names: mskf
author names: 李奕寯
author names: Jayme Soares Almeida Cruz
author names: vancha march
author names: Manuel Viens
default branch: master
number of commits: 461

organicmaps
author names: Javier Llorente
author names: Nick Hallahan
author names: Evgeny Fayvuzhinsky
author names: Isira Seneviratne
author names: Vladislav Tchyornyy
author names: Jauhien Kislakou
author names: Andrew Kovalenko
author names: AlexTECPlayz
author names: Aravind Venkata Punugu
author names: Karimullin Arthur
author names: Timofey
author names: Oscar
author names: strump
author names: kshalnev
author names: Fardeen Faisal
author names: melting-ice-cream
author names: MASangys
author names: demasterr
author names: Mikhail Gorbushin
author names: Nikhil Dhariwal
author names: Rokuz
author names: mcliquid
author names: Roman Kuznetsov
author names: Dmitry Kunin
author names: Hsieh Chin Fan
author names: Juuso Lehtinen
author names: Martin Woolley
author names: Daniil Popov
author names: vng
author names: avidseeker
author names: Trond Kjetil Bremnes
author names: Konstantin Pastbin
author names: André Wolski
author names: Jay Turner
author names: Nick Shaforostov
author names: Ilya Zverev
author names: mgsergio
author names: Linerly
author names: yanatalia
author names: Bernhard Rosenkränzer
author names: Siarhei Fedartsou
author names: Balázs Meskó
author names: ngocanhtve
author names: Altynaika
author names: Ilya Grechuhin
author names: dbf
author names: MarkHaakman
author names: Keith Conger
author names: Pi-Cla
author names: Supaplex
author names: Osyotr
author names: Victor Grigoriu
author names: yellowhat
author names: Andrzej Pomirski
author names: velichkomarija
author names: Aleksandr Blinchikov
author names: Alexander Boriskov
author names: Denis Levchenko
author names: Ondřej Sojka
author names: Alexey Osminin
author names: ja som
author names: l.dragunov
author names: Jean-BaptisteC
author names: Victor Popov
author names: Andrei Kartashev
author names: Nima
author names: Metehan Özyürek
author names: 快乐的老鼠宝宝
author names: Alexander
author names: Oleg Pakhnyuk
author names: a.marchuk
author names: tygyh
author names: Marcel Kummer
author names: Anton Makouski
author names: Mosab Mohamed
author names: Chandler Swift
author names: 秋凌烟
author names: Skrripy
author names: Sean C
author names: Ivan Komarov